BDBM76824 2-[4-(4-phenylthiazol-2-yl)piperazino]-N-piperonyl-acetamide::MLS000030010::N-(1,3-benzodioxol-5-ylmethyl)-2-[4-(4-phenyl-1,3-thiazol-2-yl)piperazin-1-yl]acetamide::N-(1,3-benzodioxol-5-ylmethyl)-2-[4-(4-phenyl-1,3-thiazol-2-yl)piperazin-1-yl]ethanamide::N-(1,3-benzodioxol-5-ylmethyl)-2-[4-(4-phenyl-2-thiazolyl)-1-piperazinyl]acetamide::N-Benzo[1,3]dioxol-5-ylmethyl-2-[4-(4-phenyl-thiazol-2-yl)-piperazin-1-yl]-acetamide::SMR000007116::cid_649023
SMILES O=C(CN1CCN(CC1)c1nc(cs1)-c1ccccc1)NCc1ccc2OCOc2c1
InChI Key InChIKey=WQNRABNOJWBXPJ-UHFFFAOYSA-N
Data  1 EC50
  Tab Delimited (TSV)   2D SDfile   Computed 3D by Vconf -m prep SDfile
Find this compound or compounds like it in BindingDB:
Activity Spreadsheet -- Enzyme Inhibition Constant Data from BindingDB
Found 1 hit for monomerid = 76824
TargetVoltage-dependent T-type calcium channel subunit alpha-1H(Homo sapiens (Human))
Vanderbilt Screening Center For Gpcrs, Ion Channels And Transporters
Curated by PubChem BioAssay
LigandPNGBDBM76824(2-[4-(4-phenylthiazol-2-yl)piperazino]-N-piperonyl...)
Affinity DataEC50:  3.41E+3nM. Assay description: Assay Provider: Xinmin Xie Assay Provider Affiliation: Bioscience Division, SRI International, Menlo Park, CA Grant Title: HTS Assay for Cav3 T-Type ...
Ligand InfoPC cidPC sid
In DepthDetails PCBioAssay