BDBM76832 4-Phenyl-piperazine-1-carboxylic acid [1-(toluene-4-sulfonyl)-piperidin-3-yl]-amide::4-phenyl-N-(1-tosyl-3-piperidyl)piperazine-1-carboxamide::MLS000027338::N-[1-(4-methylphenyl)sulfonyl-3-piperidinyl]-4-phenyl-1-piperazinecarboxamide::N-[1-(4-methylphenyl)sulfonylpiperidin-3-yl]-4-phenyl-piperazine-1-carboxamide::N-[1-(4-methylphenyl)sulfonylpiperidin-3-yl]-4-phenylpiperazine-1-carboxamide::SMR000000968::cid_650489
SMILES Cc1ccc(cc1)S(=O)(=O)N1CCCC(C1)NC(=O)N1CCN(CC1)c1ccccc1
InChI Key InChIKey=AUIYZXHRTJMRJH-UHFFFAOYSA-N
Data  1 EC50
  Tab Delimited (TSV)   2D SDfile   Computed 3D by Vconf -m prep SDfile
Find this compound or compounds like it in BindingDB:
Activity Spreadsheet -- Enzyme Inhibition Constant Data from BindingDB
Found 1 hit for monomerid = 76832
TargetVoltage-dependent T-type calcium channel subunit alpha-1H(Homo sapiens (Human))
Vanderbilt Screening Center For Gpcrs, Ion Channels And Transporters
Curated by PubChem BioAssay
LigandPNGBDBM76832(4-Phenyl-piperazine-1-carboxylic acid [1-(toluene-...)
Affinity DataEC50:  8.79E+3nM. Assay description: Assay Provider: Xinmin Xie Assay Provider Affiliation: Bioscience Division, SRI International, Menlo Park, CA Grant Title: HTS Assay for Cav3 T-Type ...
In DepthDetails PCBioAssay