BDBM76852 MLS000031972::N-(2-furanylmethyl)-2-[5-(3-methylphenyl)-2-oxo-6,7,8,9-tetrahydro-3H-[1]benzothiolo[2,3-e][1,4]diazepin-1-yl]acetamide::N-(2-furfuryl)-2-[2-keto-5-(m-tolyl)-6,7,8,9-tetrahydro-3H-benzothiopheno[2,3-e][1,4]diazepin-1-yl]acetamide::N-(furan-2-ylmethyl)-2-[5-(3-methylphenyl)-2-oxidanylidene-6,7,8,9-tetrahydro-3H-[1]benzothiolo[2,3-e][1,4]diazepin-1-yl]ethanamide::N-(furan-2-ylmethyl)-2-[5-(3-methylphenyl)-2-oxo-6,7,8,9-tetrahydro-3H-[1]benzothiolo[2,3-e][1,4]diazepin-1-yl]acetamide::N-Furan-2-ylmethyl-2-(8-oxo-5-m-tolyl-1,2,3,4,7,8-hexahydro-10-thia-6,9-diaza-benzo[a]azulen-9-yl)-acetamide::SMR000003382::cid_655063
SMILES Cc1cccc(c1)C1=NCC(=O)N(CC(=O)NCc2ccco2)c2sc3CCCCc3c12
InChI Key InChIKey=LVDCHXWLCCUJQM-UHFFFAOYSA-N
Data  1 EC50
  Tab Delimited (TSV)   2D SDfile   Computed 3D by Vconf -m prep SDfile
Find this compound or compounds like it in BindingDB:
Activity Spreadsheet -- Enzyme Inhibition Constant Data from BindingDB
Found 1 hit for monomerid = 76852
TargetVoltage-dependent T-type calcium channel subunit alpha-1H(Homo sapiens (Human))
Vanderbilt Screening Center For Gpcrs, Ion Channels And Transporters
Curated by PubChem BioAssay
LigandPNGBDBM76852(MLS000031972 | N-(2-furanylmethyl)-2-[5-(3-methylp...)
Affinity DataEC50:  4.37E+3nM. Assay description: Assay Provider: Xinmin Xie Assay Provider Affiliation: Bioscience Division, SRI International, Menlo Park, CA Grant Title: HTS Assay for Cav3 T-Type ...
In DepthDetails PCBioAssay