BDBM76967 MLS000089351::N-(4-methylcyclohexyl)-1-[[5-methyl-2-(3-methylphenyl)-1,3-oxazol-4-yl]methyl]piperidine-3-carboxamide::N-(4-methylcyclohexyl)-1-[[5-methyl-2-(3-methylphenyl)-4-oxazolyl]methyl]-3-piperidinecarboxamide::N-(4-methylcyclohexyl)-1-[[5-methyl-2-(m-tolyl)oxazol-4-yl]methyl]nipecotamide::N-(4-methylcyclohexyl)-1-{[5-methyl-2-(3-methylphenyl)-1,3-oxazol-4-yl]methyl}piperidine-3-carboxamide::SMR000027726::cid_3244705
SMILES CC1CCC(CC1)NC(=O)C1CCCN(Cc2nc(oc2C)-c2cccc(C)c2)C1
InChI Key InChIKey=YUHTWXOGESTTCJ-UHFFFAOYSA-N
Data  1 EC50
  Tab Delimited (TSV)   2D SDfile   Computed 3D by Vconf -m prep SDfile
Find this compound or compounds like it in BindingDB:
Activity Spreadsheet -- Enzyme Inhibition Constant Data from BindingDB
Found 1 hit for monomerid = 76967
TargetVoltage-dependent T-type calcium channel subunit alpha-1H(Homo sapiens (Human))
Vanderbilt Screening Center For Gpcrs, Ion Channels And Transporters
Curated by PubChem BioAssay
LigandPNGBDBM76967(MLS000089351 | N-(4-methylcyclohexyl)-1-[[5-methyl...)
Affinity DataEC50:  5.64E+3nM. Assay description: Assay Provider: Xinmin Xie Assay Provider Affiliation: Bioscience Division, SRI International, Menlo Park, CA Grant Title: HTS Assay for Cav3 T-Type ...
In DepthDetails PCBioAssay