BDBM77138 5-(4-Methoxy-phenyl)-3-phenyl-2-thioxo-2,3,5,6-tetrahydro-4H-thiazolo[4,5-d]pyrimidin-7-one::5-(4-methoxyphenyl)-3-phenyl-2-sulfanylidene-5,6-dihydro-4H-[1,3]thiazolo[4,5-d]pyrimidin-7-one::5-(4-methoxyphenyl)-3-phenyl-2-sulfanylidene-5,6-dihydro-4H-thiazolo[4,5-d]pyrimidin-7-one::5-(4-methoxyphenyl)-3-phenyl-2-thioxo-5,6-dihydro-4H-thiazolo[4,5-d]pyrimidin-7-one::MLS000526961::SMR000117435::cid_2860661
SMILES COc1ccc(cc1)C1Nc2c(sc(=S)n2-c2ccccc2)C(=O)N1
InChI Key InChIKey=LMKVCTSTEZHCDR-UHFFFAOYSA-N
Data  1 EC50
  Tab Delimited (TSV)   2D SDfile   Computed 3D by Vconf -m prep SDfile
Find this compound or compounds like it in BindingDB:
Activity Spreadsheet -- Enzyme Inhibition Constant Data from BindingDB
Found 1 hit for monomerid = 77138
TargetVoltage-dependent T-type calcium channel subunit alpha-1H(Homo sapiens (Human))
Vanderbilt Screening Center For Gpcrs, Ion Channels And Transporters
Curated by PubChem BioAssay
LigandPNGBDBM77138(5-(4-Methoxy-phenyl)-3-phenyl-2-thioxo-2,3,5,6-tet...)
Affinity DataEC50:  1.23E+3nM. Assay description: Assay Provider: Xinmin Xie Assay Provider Affiliation: Bioscience Division, SRI International, Menlo Park, CA Grant Title: HTS Assay for Cav3 T-Type ...
In DepthDetails PCBioAssay