BDBM77160 3-(4-Chloro-phenyl)-4,5-dihydro-isoxazole-5-carboxylic acid (benzo[1,3]dioxol-5-ylmethyl)-amide::3-(4-chlorophenyl)-N-piperonyl-2-isoxazoline-5-carboxamide::MLS000528807::N-(1,3-benzodioxol-5-ylmethyl)-3-(4-chlorophenyl)-4,5-dihydro-1,2-oxazole-5-carboxamide::N-(1,3-benzodioxol-5-ylmethyl)-3-(4-chlorophenyl)-4,5-dihydroisoxazole-5-carboxamide::SMR000121282::cid_3158124
SMILES Clc1ccc(cc1)C1=NOC(C1)C(=O)NCc1ccc2OCOc2c1
InChI Key InChIKey=YFERGTSUZSKRRO-UHFFFAOYSA-N
Data  1 EC50
  Tab Delimited (TSV)   2D SDfile   Computed 3D by Vconf -m prep SDfile
Find this compound or compounds like it in BindingDB:
Activity Spreadsheet -- Enzyme Inhibition Constant Data from BindingDB
Found 1 hit for monomerid = 77160
TargetVoltage-dependent T-type calcium channel subunit alpha-1H(Homo sapiens (Human))
Vanderbilt Screening Center For Gpcrs, Ion Channels And Transporters
Curated by PubChem BioAssay
LigandPNGBDBM77160(3-(4-Chloro-phenyl)-4,5-dihydro-isoxazole-5-carbox...)
Affinity DataEC50:  496nM. Assay description: Assay Provider: Xinmin Xie Assay Provider Affiliation: Bioscience Division, SRI International, Menlo Park, CA Grant Title: HTS Assay for Cav3 T-Type ...
In DepthDetails PCBioAssay