BDBM7722 (3Z)-N-[2-(1H-imidazol-4-yl)ethyl]-2-oxo-3-[2-(4-sulfamoylphenyl)hydrazin-1-ylidene]-2,3-dihydro-1H-indole-5-carboxamide::3-{[4-(Aminosulfonyl)phenyl]hydrazono}-N-[2-(1H-imidazol-4-yl)ethyl]-2-oxo-2,3-dihydro-1H-indole-5-carboxamide::CS261::Oxindole-Based Inhibitor 58
SMILES NS(=O)(=O)c1ccc(NN=C2C(=O)Nc3ccc(cc23)C(=O)NCCc2cnc[nH]2)cc1
InChI Key InChIKey=CQSUILWVYSOEJC-UHFFFAOYSA-N
Data  4 IC50  4 Kd
  Tab Delimited (TSV)   2D SDfile   Computed 3D by Vconf -m prep SDfile
Find this compound or compounds like it in BindingDB:
Activity Spreadsheet -- Enzyme Inhibition Constant Data from BindingDB
Found 8 hits for monomerid = 7722
TargetCyclin-dependent kinase/G2/mitotic-specific cyclin- 1(Homo sapiens (Human))
Glaxosmithkline
LigandPNGBDBM7722((3Z)-N-[2-(1H-imidazol-4-yl)ethyl]-2-oxo-3-[2-(4-s...)
Affinity DataIC50:  69nM. Assay description: The biochemical activity of compounds was determined by incubation with specific enzymes and substrates in the presence 1.4 uM ATP/[gamma-32P] ATP. A...
In DepthDetails ArticlePubMed
TargetCyclin-A2/Cyclin-dependent kinase 2(Homo sapiens (Human))
Glaxosmithkline
LigandPNGBDBM7722((3Z)-N-[2-(1H-imidazol-4-yl)ethyl]-2-oxo-3-[2-(4-s...)
Affinity DataIC50:  12nM. Assay description: The biochemical activity of compounds was determined by incubation with specific enzymes and substrates in the presence 1.4 uM ATP/[gamma-32P] ATP. A...
In DepthDetails ArticlePubMed
TargetCyclin-dependent kinase 2(Homo sapiens (Human))
Csar
LigandPNGBDBM7722((3Z)-N-[2-(1H-imidazol-4-yl)ethyl]-2-oxo-3-[2-(4-s...)
Affinity DataKd:  251nMpH: 7.5 T: 2°C. Assay description: OctetRed
In DepthDetails PubMed
TargetCyclin-dependent kinase 2(Homo sapiens (Human))
Csar
LigandPNGBDBM7722((3Z)-N-[2-(1H-imidazol-4-yl)ethyl]-2-oxo-3-[2-(4-s...)
Affinity DataIC50:  12nM. Assay description: Inhibition of CDK2
In DepthDetails ArticlePubMed
TargetCyclin-dependent kinase 2(Homo sapiens (Human))
Csar
LigandPNGBDBM7722((3Z)-N-[2-(1H-imidazol-4-yl)ethyl]-2-oxo-3-[2-(4-s...)
Affinity DataKd:  1.28E+3nMpH: 7.5 T: 2°C. Assay description: ITC
In DepthDetails PubMed
TargetCyclin-A2/Cyclin-dependent kinase 2(Homo sapiens (Human))
Glaxosmithkline
LigandPNGBDBM7722((3Z)-N-[2-(1H-imidazol-4-yl)ethyl]-2-oxo-3-[2-(4-s...)
Affinity DataKd:  82nMpH: 7.5 T: 2°C. Assay description: OctetRed
In DepthDetails PubMed
TargetCyclin-dependent kinase 1(Homo sapiens (Human))
University Of Zurich
Curated by ChEMBL
LigandPNGBDBM7722((3Z)-N-[2-(1H-imidazol-4-yl)ethyl]-2-oxo-3-[2-(4-s...)
Affinity DataIC50:  60nM. Assay description: Inhibition of CDK1
In DepthDetails ArticlePubMed
TargetCyclin-dependent kinase 2(Homo sapiens (Human))
Csar
LigandPNGBDBM7722((3Z)-N-[2-(1H-imidazol-4-yl)ethyl]-2-oxo-3-[2-(4-s...)
Affinity DataKd:  3.12E+3nMpH: 7.5 T: 2°C. Assay description: Thermofluor
In DepthDetails PubMed