BDBM77259 2-[[2-(4-methoxyphenyl)-5-methyl-1,3-oxazol-4-yl]methylsulfanyl]-N-(1,2,3,4-tetrahydronaphthalen-1-yl)acetamide::2-[[2-(4-methoxyphenyl)-5-methyl-1,3-oxazol-4-yl]methylsulfanyl]-N-(1,2,3,4-tetrahydronaphthalen-1-yl)ethanamide::2-[[2-(4-methoxyphenyl)-5-methyl-4-oxazolyl]methylthio]-N-(1,2,3,4-tetrahydronaphthalen-1-yl)acetamide::2-[[2-(4-methoxyphenyl)-5-methyl-oxazol-4-yl]methylthio]-N-tetralin-1-yl-acetamide::MLS000520325::SMR000130737::cid_9550962
SMILES COc1ccc(cc1)-c1nc(CSCC(=O)NC2CCCc3ccccc23)c(C)o1
InChI Key InChIKey=XKNNMQRTRGIVJH-UHFFFAOYSA-N
Data  1 IC50  1 EC50
  Tab Delimited (TSV)   2D SDfile   Computed 3D by Vconf -m prep SDfile
Find this compound or compounds like it in BindingDB:
Activity Spreadsheet -- Enzyme Inhibition Constant Data from BindingDB
Found 2 hits for monomerid = 77259
TargetPotassium voltage-gated channel subfamily KQT member 2(Rattus norvegicus)
Johns Hopkins Ion Channel Center
Curated by PubChem BioAssay
LigandPNGBDBM77259(2-[[2-(4-methoxyphenyl)-5-methyl-1,3-oxazol-4-yl]m...)
Affinity DataIC50:  1.76E+3nM. Assay description: Source (MLPCN Center Name): Johns Hopkins Ion Channel Center (JHICC_KCNQ2_Inh_HFCP_IWS_CRC) Center Affiliation: Johns Hopkins University, School of M...
In DepthDetails PCBioAssay
TargetVoltage-dependent T-type calcium channel subunit alpha-1H(Homo sapiens (Human))
Vanderbilt Screening Center For Gpcrs, Ion Channels And Transporters
Curated by PubChem BioAssay
LigandPNGBDBM77259(2-[[2-(4-methoxyphenyl)-5-methyl-1,3-oxazol-4-yl]m...)
Affinity DataEC50:  3.95E+3nM. Assay description: Assay Provider: Xinmin Xie Assay Provider Affiliation: Bioscience Division, SRI International, Menlo Park, CA Grant Title: HTS Assay for Cav3 T-Type ...
In DepthDetails PCBioAssay