BDBM77303 2-[[5-(4-chlorophenyl)-4-(2-furfuryl)-1,2,4-triazol-3-yl]thio]-N-piperonyl-acetamide::MLS000567039::N-(1,3-benzodioxol-5-ylmethyl)-2-[[5-(4-chlorophenyl)-4-(2-furanylmethyl)-1,2,4-triazol-3-yl]thio]acetamide::N-(1,3-benzodioxol-5-ylmethyl)-2-[[5-(4-chlorophenyl)-4-(furan-2-ylmethyl)-1,2,4-triazol-3-yl]sulfanyl]acetamide::N-(1,3-benzodioxol-5-ylmethyl)-2-[[5-(4-chlorophenyl)-4-(furan-2-ylmethyl)-1,2,4-triazol-3-yl]sulfanyl]ethanamide::SMR000153787::cid_2477828
SMILES Clc1ccc(cc1)-c1nnc(SCC(=O)NCc2ccc3OCOc3c2)n1Cc1ccco1
InChI Key InChIKey=XRYBSVLGOXABNS-UHFFFAOYSA-N
Data  1 EC50
  Tab Delimited (TSV)   2D SDfile   Computed 3D by Vconf -m prep SDfile
Find this compound or compounds like it in BindingDB:
Activity Spreadsheet -- Enzyme Inhibition Constant Data from BindingDB
Found 1 hit for monomerid = 77303
TargetVoltage-dependent T-type calcium channel subunit alpha-1H(Homo sapiens (Human))
Vanderbilt Screening Center For Gpcrs, Ion Channels And Transporters
Curated by PubChem BioAssay
LigandPNGBDBM77303(2-[[5-(4-chlorophenyl)-4-(2-furfuryl)-1,2,4-triazo...)
Affinity DataEC50:  1.11E+3nM. Assay description: Assay Provider: Xinmin Xie Assay Provider Affiliation: Bioscience Division, SRI International, Menlo Park, CA Grant Title: HTS Assay for Cav3 T-Type ...
In DepthDetails PCBioAssay