BDBM77543 MLS000714525::N-[(5-chloranyl-8-oxidanyl-quinolin-7-yl)-thiophen-2-yl-methyl]pentanamide::N-[(5-chloro-8-hydroxy-7-quinolinyl)-thiophen-2-ylmethyl]pentanamide::N-[(5-chloro-8-hydroxy-7-quinolyl)-(2-thienyl)methyl]valeramide::N-[(5-chloro-8-hydroxyquinolin-7-yl)-thiophen-2-ylmethyl]pentanamide::SMR000274504::cid_2928736
SMILES CCCCC(=O)NC(c1cccs1)c1cc(Cl)c2cccnc2c1O
InChI Key InChIKey=YXHNNUCABLCYSD-UHFFFAOYSA-N
Data  2 IC50
  Tab Delimited (TSV)   2D SDfile   Computed 3D by Vconf -m prep SDfile
Find this compound or compounds like it in BindingDB:
Activity Spreadsheet -- Enzyme Inhibition Constant Data from BindingDB
Found 2 hits for monomerid = 77543
TargetGroup 3 secretory phospholipase A2(Homo sapiens)
The Scripps Research Institute Molecular Screening Center
Curated by PubChem BioAssay
LigandPNGBDBM77543(MLS000714525 | N-[(5-chloranyl-8-oxidanyl-quinolin...)
Affinity DataIC50:  1.22E+5nM. Assay description: Source (MLPCN Center Name): The Scripps Research Institute Molecular Screening Center Affiliation: The Scripps Research Institute, TSRI Assay Provide...
In DepthDetails PCBioAssay
TargetRecBCD enzyme subunit RecD(Escherichia coli str. K-12 substr. MG1655)
The Scripps Research Institute Molecular Screening Center
Curated by PubChem BioAssay
LigandPNGBDBM77543(MLS000714525 | N-[(5-chloranyl-8-oxidanyl-quinolin...)
Affinity DataIC50: >1.19E+5nM. Assay description: Source (MLPCN Center Name): The Scripps Research Institute Molecular Screening Center (SRIMSC) Affiliation: The Scripps Research Institute, TSRI Assa...
In DepthDetails PCBioAssay