BDBM77595 5-nitro-N-(1-propyl-2-benzimidazolyl)-2-furancarboxamide::5-nitro-N-(1-propylbenzimidazol-2-yl)-2-furamide::5-nitro-N-(1-propylbenzimidazol-2-yl)furan-2-carboxamide::MLS001138602::SMR000715180::cid_24980351
SMILES CCCn1c(NC(=O)c2ccc(o2)[N+]([O-])=O)nc2ccccc12
InChI Key InChIKey=QXSUNGXUTAFLCR-UHFFFAOYSA-N
Data  1 IC50
  Tab Delimited (TSV)   2D SDfile   Computed 3D by Vconf -m prep SDfile
Find this compound or compounds like it in BindingDB:
Activity Spreadsheet -- Enzyme Inhibition Constant Data from BindingDB
Found 1 hit for monomerid = 77595
TargetRecBCD enzyme subunit RecD(Escherichia coli str. K-12 substr. MG1655)
The Scripps Research Institute Molecular Screening Center
Curated by PubChem BioAssay
LigandPNGBDBM77595(5-nitro-N-(1-propyl-2-benzimidazolyl)-2-furancarbo...)
Affinity DataIC50: >1.18E+5nM. Assay description: Source (MLPCN Center Name): The Scripps Research Institute Molecular Screening Center (SRIMSC) Affiliation: The Scripps Research Institute, TSRI Assa...
In DepthDetails PCBioAssay