BDBM77736 1H-benzimidazol-2-yl-[[(E)-3-phenylprop-2-enylidene]amino]amine::MLS000390936::N-[[(E)-3-phenylprop-2-enylidene]amino]-1H-benzimidazol-2-amine::SMR000259973::cid_2328475
SMILES C(C=CN=Nc1nc2ccccc2[nH]1)c1ccccc1
InChI Key InChIKey=YYLJKRXQBMMDKM-UZTRUTTLSA-N
Data  4 IC50
  Tab Delimited (TSV)   2D SDfile   Computed 3D by Vconf -m prep SDfile
Find this compound or compounds like it in BindingDB:
Activity Spreadsheet -- Enzyme Inhibition Constant Data from BindingDB
Found 4 hits for monomerid = 77736
TargetMitochondrial import inner membrane translocase subunit TIM10(Saccharomyces cerevisiae S288c)
Burnham Center For Chemical Genomics
Curated by PubChem BioAssay
LigandPNGBDBM77736(1H-benzimidazol-2-yl-[[(E)-3-phenylprop-2-enyliden...)
Affinity DataIC50: >1.00E+5nM. Assay description: Data Source: Sanford-Burnham Center for Chemical Genomics (SBCCG) Source Affiliation: Sanford-Burnham Medical Research Institute(SBMRI, San Diego, CA...
In DepthDetails PCBioAssay
TargetMitochondrial import inner membrane translocase subunit TIM10(Saccharomyces cerevisiae S288c)
Burnham Center For Chemical Genomics
Curated by PubChem BioAssay
LigandPNGBDBM77736(1H-benzimidazol-2-yl-[[(E)-3-phenylprop-2-enyliden...)
Affinity DataIC50:  8.98E+3nM. Assay description: Data Source: Sanford-Burnham Center for Chemical Genomics (SBCCG) Source Affiliation: Sanford-Burnham Medical Research Institute(SBMRI, San Diego, CA...
In DepthDetails PCBioAssay
TargetMitochondrial import inner membrane translocase subunit TIM10(Saccharomyces cerevisiae S288c)
Burnham Center For Chemical Genomics
Curated by PubChem BioAssay
LigandPNGBDBM77736(1H-benzimidazol-2-yl-[[(E)-3-phenylprop-2-enyliden...)
Affinity DataIC50:  6.75E+4nM. Assay description: Data Source: Sanford-Burnham Center for Chemical Genomics (SBCCG) Source Affiliation: Sanford-Burnham Medical Research Institute(SBMRI, San Diego, CA...
In DepthDetails PCBioAssay
TargetMitochondrial import inner membrane translocase subunit TIM23(Saccharomyces cerevisiae S288c)
Burnham Center For Chemical Genomics
Curated by PubChem BioAssay
LigandPNGBDBM77736(1H-benzimidazol-2-yl-[[(E)-3-phenylprop-2-enyliden...)
Affinity DataIC50:  1.12E+4nM. Assay description: Data Source: Sanford-Burnham Center for Chemical Genomics (SBCCG) Source Affiliation: Sanford-Burnham Medical Research Institute(SBMRI, San Diego, CA...
In DepthDetails PCBioAssay