BDBM7783 2,4-Dibenzyl-1,2,4-thiadiazolidine-3,5-dione::Thiadiazolidinone (TDZD) deriv. 10
SMILES O=c1sn(Cc2ccccc2)c(=O)n1Cc1ccccc1
InChI Key InChIKey=SGSVNPJHIDULGL-UHFFFAOYSA-N
Data  3 IC50
  Tab Delimited (TSV)   2D SDfile   Computed 3D by Vconf -m prep SDfile
Find this compound or compounds like it in BindingDB:
Activity Spreadsheet -- Enzyme Inhibition Constant Data from BindingDB
Found 3 hits for monomerid = 7783
TargetGlycogen synthase kinase-3 beta [7-25](Oryctolagus cuniculus (rabbit))
Instituto De Quimica Medica (Csic)
LigandPNGBDBM7783(2,4-Dibenzyl-1,2,4-thiadiazolidine-3,5-dione | Thi...)
Affinity DataIC50:  1.00E+4nMpH: 7.5 T: 2°C. Assay description: Kinase activities were assayed in buffers containing substrate, enzyme, and inhibitor at 37 °C in the presence of 15 uM ATP/ [gamma-32P] ATP. 32...
In DepthDetails ArticlePubMed
TargetSortase family protein(Staphylococcus aureus)
Guizhou University
Curated by ChEMBL
LigandPNGBDBM7783(2,4-Dibenzyl-1,2,4-thiadiazolidine-3,5-dione | Thi...)
Affinity DataIC50:  7.00E+3nM. Assay description: Inhibition of Staphylococcus aureus SrtA delta N24 mutant expressed in Escherichia coli BL21 (DE3) using Abz-LPATG-Dnp substrate incubated for 20 min...
In DepthDetails ArticlePubMed
TargetSortase family protein(Staphylococcus aureus)
Guizhou University
Curated by ChEMBL
LigandPNGBDBM7783(2,4-Dibenzyl-1,2,4-thiadiazolidine-3,5-dione | Thi...)
Affinity DataIC50:  1.29E+4nM. Assay description: Inhibition of Staphylococcus aureus SrtA delta N24 mutant expressed in Escherichia coli BL21 (DE3) assessed as reduction in IsdA (64 to 323 residues)...
In DepthDetails ArticlePubMed