BDBM7899 1-(3-(1H-Imidazol-1-yl)propyl)-3-naphthalen-1-ylthiourea::1-alkylimidazole thiourea deriv. 34::3-[3-(1H-imidazol-1-yl)propyl]-1-naphthalen-1-ylthiourea
SMILES S=C(NCCCn1ccnc1)Nc1cccc2ccccc12
InChI Key InChIKey=HJLUOMDENSYZEH-UHFFFAOYSA-N
Data  1 KI
  Tab Delimited (TSV)   2D SDfile   Computed 3D by Vconf -m prep SDfile
Find this compound or compounds like it in BindingDB:
Activity Spreadsheet -- Enzyme Inhibition Constant Data from BindingDB
Found 1 hit for monomerid = 7899
TargetGlutaminyl-peptide cyclotransferase(Homo sapiens (Human))
Probiodrug
LigandPNGBDBM7899(1-(3-(1H-Imidazol-1-yl)propyl)-3-naphthalen-1-ylth...)
Affinity DataKi:  2.79E+3nM ΔG°:  -7.70kcal/molepH: 8.0 T: 2°C. Assay description: QC activity was evaluated fluorometrically using Gln-AMC as substrate, and pyroglutamyl peptidase as the auxiliary enzyme. After conversion of Gln-AM...
In DepthDetails ArticlePubMed