BDBM79431 MLS000519824::SMR000130242::[4-(4-fluorophenyl)-1-piperazinyl]-[1-(4-methoxyanilino)-4-isoquinolinyl]methanone::[4-(4-fluorophenyl)piperazin-1-yl]-[1-(4-methoxyanilino)isoquinolin-4-yl]methanone::[4-(4-fluorophenyl)piperazin-1-yl]-[1-[(4-methoxyphenyl)amino]isoquinolin-4-yl]methanone::[4-(4-fluorophenyl)piperazino]-[1-(p-anisidino)-4-isoquinolyl]methanone::cid_9550319
SMILES COc1ccc(Nc2ncc(C(=O)N3CCN(CC3)c3ccc(F)cc3)c3ccccc23)cc1
InChI Key InChIKey=JEGDKRQQLMZELX-UHFFFAOYSA-N
Data  2 EC50
  Tab Delimited (TSV)   2D SDfile   Computed 3D by Vconf -m prep SDfile
Find this compound or compounds like it in BindingDB:
Activity Spreadsheet -- Enzyme Inhibition Constant Data from BindingDB
Found 2 hits for monomerid = 79431
TargetCaspase-7(Homo sapiens (Human))
The Scripps Research Institute Molecular Screening Center
Curated by PubChem BioAssay
LigandPNGBDBM79431(MLS000519824 | SMR000130242 | [4-(4-fluorophenyl)-...)
Affinity DataEC50: >8.52E+4nM. Assay description: Source (MLPCN Center Name): The Scripps Research Institute Molecular Screening Center (SRIMSC) Affiliation: The Scripps Research Institute, TSRI Assa...
In DepthDetails PCBioAssay
TargetCaspase-3(Homo sapiens (Human))
The Scripps Research Institute Molecular Screening Center
Curated by PubChem BioAssay
LigandPNGBDBM79431(MLS000519824 | SMR000130242 | [4-(4-fluorophenyl)-...)
Affinity DataEC50: >8.52E+4nM. Assay description: Source (MLPCN Center Name): The Scripps Research Institute Molecular Screening Center (SRIMSC) Affiliation: The Scripps Research Institute, TSRI Assa...
In DepthDetails PCBioAssay