BDBM7946 1-benzoyl-1H-imidazole::Imidazole N-1 deriv. 7::N-Benzoylimidazole
SMILES O=C(c1ccccc1)n1ccnc1
InChI Key InChIKey=JEGIFBGJZPYMJS-UHFFFAOYSA-N
Data  1 KI
  Tab Delimited (TSV)   2D SDfile   Computed 3D by Vconf -m prep SDfile
Find this compound or compounds like it in BindingDB:
Activity Spreadsheet -- Enzyme Inhibition Constant Data from BindingDB
Found 1 hit for monomerid = 7946
TargetGlutaminyl-peptide cyclotransferase(Homo sapiens (Human))
Probiodrug
LigandPNGBDBM7946(1-benzoyl-1H-imidazole | Imidazole N-1 deriv. 7 | ...)
Affinity DataKi:  1.74E+5nM ΔG°:  -5.21kcal/molepH: 8.0 T: 2°C. Assay description: QC activity was evaluated fluorometrically using Gln-AMC as substrate, and pyroglutamyl peptidase as the auxiliary enzyme. After conversion of Gln-AM...
In DepthDetails ArticlePubMed