BDBM7949 Imidazole C-4(5) deriv. 1::N-[2-(1H-Imidazol-4-yl)ethyl]acetamide::N-omega-Acetylhistamine::N-w-acetylhistamine (AH)
SMILES CC(=O)NCCc1cnc[nH]1
InChI Key InChIKey=XJWPISBUKWZALE-UHFFFAOYSA-N
Data  3 KI
PDB links: 1 PDB ID matches this monomer.
  Tab Delimited (TSV)   2D SDfile   Computed 3D by Vconf -m prep SDfile
Find this compound or compounds like it in BindingDB:
Activity Spreadsheet -- Enzyme Inhibition Constant Data from BindingDB
Found 3 hits for monomerid = 7949
TargetGlutaminyl-peptide cyclotransferase(Homo sapiens (Human))
Academia Sinica
LigandPNGBDBM7949(Imidazole C-4(5) deriv. 1 | N-[2-(1H-Imidazol-4-yl...)
Affinity DataKi:  1.70E+3nM ΔG°:  -7.87kcal/molepH: 8.0 T: 2°C. Assay description: The testing for the inhibition activities of imidazole derivatives and cacodylate on gQC and sQC was evaluated at 25 C using the fluorescent substrat...
TargetGlutaminyl-peptide cyclotransferase(Homo sapiens (Human))
Academia Sinica
LigandPNGBDBM7949(Imidazole C-4(5) deriv. 1 | N-[2-(1H-Imidazol-4-yl...)
Affinity DataKi:  5.75E+3nM ΔG°:  -7.14kcal/molepH: 8.0 T: 2°C. Assay description: The testing for the inhibition activities of imidazole derivatives and cacodylate on gQC and sQC was evaluated at 25 C using the fluorescent substrat...
TargetGlutaminyl-peptide cyclotransferase(Homo sapiens (Human))
Academia Sinica
LigandPNGBDBM7949(Imidazole C-4(5) deriv. 1 | N-[2-(1H-Imidazol-4-yl...)
Affinity DataKi:  1.70E+4nM ΔG°:  -6.61kcal/molepH: 8.0 T: 2°C. Assay description: QC activity was evaluated fluorometrically using Gln-AMC as substrate, and pyroglutamyl peptidase as the auxiliary enzyme. After conversion of Gln-AM...