BDBM79556 3-(4-fluorophenyl)-2-(4-fluorophenyl)imino-4-keto-1,3-thiazine-6-carboxylic acid methyl ester::3-(4-fluorophenyl)-2-(4-fluorophenyl)imino-4-oxo-1,3-thiazine-6-carboxylic acid methyl ester::MLS000586864::SMR000208794::cid_1519056::methyl (2Z)-3-(4-fluorophenyl)-2-[(4-fluorophenyl)imino]-4-oxo-3,4-dihydro-2H-1,3-thiazine-6-carboxylate::methyl 3-(4-fluorophenyl)-2-(4-fluorophenyl)imino-4-oxidanylidene-1,3-thiazine-6-carboxylate::methyl 3-(4-fluorophenyl)-2-(4-fluorophenyl)imino-4-oxo-1,3-thiazine-6-carboxylate
SMILES COC(=O)c1cc(=O)n(-c2ccc(F)cc2)\c(=N\c2ccc(F)cc2)s1
InChI Key InChIKey=GBVALLVLDYCKRT-UZYVYHOESA-N
Data  3 IC50  1 EC50
  Tab Delimited (TSV)   2D SDfile   Computed 3D by Vconf -m prep SDfile
Find this compound or compounds like it in BindingDB:
Activity Spreadsheet -- Enzyme Inhibition Constant Data from BindingDB
Found 4 hits for monomerid = 79556
TargetNeurotensin receptor type 1(Homo sapiens (Human))
Burnham Center For Chemical Genomics
Curated by PubChem BioAssay
LigandPNGBDBM79556(3-(4-fluorophenyl)-2-(4-fluorophenyl)imino-4-keto-...)
Affinity DataEC50:  1.11E+4nM. Assay description: Data Source: Sanford-Burnham Center for Chemical Genomics (SBCCG) Source Affiliation: Sanford-Burnham Medical Research Institute (SBMRI, San Diego, C...
In DepthDetails PCBioAssay
TargetPerilipin-5(Homo sapiens (Human))
The Scripps Research Institute Molecular Screening Center
Curated by PubChem BioAssay
LigandPNGBDBM79556(3-(4-fluorophenyl)-2-(4-fluorophenyl)imino-4-keto-...)
Affinity DataIC50:  3.09E+3nM
In DepthDetails PCBioAssay
TargetPerilipin-1(Homo sapiens (Human))
The Scripps Research Institute Molecular Screening Center
Curated by PubChem BioAssay
LigandPNGBDBM79556(3-(4-fluorophenyl)-2-(4-fluorophenyl)imino-4-keto-...)
Affinity DataIC50:  2.50E+3nM
In DepthDetails PCBioAssay
TargetHepatocyte nuclear factor 4-alpha(Homo sapiens (Human))
The Scripps Research Institute Molecular Screening Center
Curated by PubChem BioAssay
LigandPNGBDBM79556(3-(4-fluorophenyl)-2-(4-fluorophenyl)imino-4-keto-...)
Affinity DataIC50:  4.10E+3nM
In DepthDetails PCBioAssay