BDBM79593 1,2,4-triphenyl-6-(p-tolyl)pyridin-1-ium;perchlorate::2-(4-methylphenyl)-1,4,6-triphenyl-pyridin-1-ium;perchlorate::2-(4-methylphenyl)-1,4,6-triphenylpyridin-1-ium;perchlorate::MLS001240931::SMR000841283::cid_12627144
SMILES Cc1ccc(cc1)-c1cc(cc(-c2ccccc2)[n+]1-c1ccccc1)-c1ccccc1
InChI Key InChIKey=WLSZYYJDVSBLTI-UHFFFAOYSA-N
Data  1 EC50
  Tab Delimited (TSV)   2D SDfile   Computed 3D by Vconf -m prep SDfile
Find this compound or compounds like it in BindingDB:
Activity Spreadsheet -- Enzyme Inhibition Constant Data from BindingDB
Found 1 hit for monomerid = 79593
TargetNeurotensin receptor type 1(Homo sapiens (Human))
Burnham Center For Chemical Genomics
Curated by PubChem BioAssay
LigandPNGBDBM79593(1,2,4-triphenyl-6-(p-tolyl)pyridin-1-ium;perchlora...)
Affinity DataEC50:  7.49E+3nM. Assay description: Data Source: Sanford-Burnham Center for Chemical Genomics (SBCCG) Source Affiliation: Sanford-Burnham Medical Research Institute (SBMRI, San Diego, C...
In DepthDetails PCBioAssay