BDBM79666 5-amino-4-cyano-3-[[1-oxo-2-[[oxo-(3,4,5-trimethoxyphenyl)methyl]amino]ethoxy]methyl]-2-thiophenecarboxylic acid ethyl ester::5-amino-4-cyano-3-[[2-[(3,4,5-trimethoxybenzoyl)amino]acetyl]oxymethyl]thiophene-2-carboxylic acid ethyl ester::MLS000572184::SMR000151165::cid_4833145::ethyl 5-amino-4-cyano-3-[[2-[(3,4,5-trimethoxybenzoyl)amino]acetyl]oxymethyl]thiophene-2-carboxylate::ethyl 5-azanyl-4-cyano-3-[2-[(3,4,5-trimethoxyphenyl)carbonylamino]ethanoyloxymethyl]thiophene-2-carboxylate
SMILES CCOC(=O)c1sc(N)c(C#N)c1COC(=O)CNC(=O)c1cc(OC)c(OC)c(OC)c1
InChI Key InChIKey=MBCCPAPIRVHTAV-UHFFFAOYSA-N
Data  1 EC50
  Tab Delimited (TSV)   2D SDfile   Computed 3D by Vconf -m prep SDfile
Find this compound or compounds like it in BindingDB:
Activity Spreadsheet -- Enzyme Inhibition Constant Data from BindingDB
Found 1 hit for monomerid = 79666
TargetTropomyosin alpha-1 chain(Sus scrofa)
The Scripps Research Institute Molecular Screening Center
Curated by PubChem BioAssay
LigandPNGBDBM79666(5-amino-4-cyano-3-[[1-oxo-2-[[oxo-(3,4,5-trimethox...)
Affinity DataEC50:  1.11E+4nM. Assay description: Source (MLPCN Center Name): The Scripps Research Institute Molecular Screening Center (SRIMSC) Affiliation: The Scripps Research Institute, TSRI Assa...
In DepthDetails PCBioAssay