BDBM79885 9H-carbazole-3-carboxylic acid ethyl ester::MLS001049111::SMR000386943::cid_1935506::ethyl 9H-carbazole-3-carboxylate
SMILES CCOC(=O)c1ccc2[nH]c3ccccc3c2c1
InChI Key InChIKey=NLLKBEGFXZYBFX-UHFFFAOYSA-N
Data  2 IC50
  Tab Delimited (TSV)   2D SDfile   Computed 3D by Vconf -m prep SDfile
Find this compound or compounds like it in BindingDB:
Activity Spreadsheet -- Enzyme Inhibition Constant Data from BindingDB
Found 2 hits for monomerid = 79885
TargetOrexin/Hypocretin receptor type 1(Human)
The Scripps Research Institute Molecular Screening Center
Curated by PubChem BioAssay
LigandPNGBDBM79885(9H-carbazole-3-carboxylic acid ethyl ester | MLS00...)
Affinity DataIC50:  3.59E+3nM. Assay description: Source (MLPCN Center Name): The Scripps Research Institute Molecular Screening Center (SRIMSC) Affiliation: The Scripps Research Institute, TSRI Assa...
In DepthDetails PCBioAssay
TargetOrexin/Hypocretin receptor type 1(Human)
The Scripps Research Institute Molecular Screening Center
Curated by PubChem BioAssay
LigandPNGBDBM79885(9H-carbazole-3-carboxylic acid ethyl ester | MLS00...)
Affinity DataIC50:  1.99E+3nM. Assay description: Source (MLPCN Center Name): The Scripps Research Institute Molecular Screening Center (SRIMSC) Affiliation: The Scripps Research Institute, TSRI Assa...
In DepthDetails PCBioAssay