BDBM80145 4-[(6-nitro-1,3-benzodioxol-5-yl)methyleneamino]-3-phenyl-1H-1,2,4-triazole-5-thione::4-[(6-nitro-1,3-benzodioxol-5-yl)methylideneamino]-3-phenyl-1H-1,2,4-triazole-5-thione::4-[({6-nitro-1,3-benzodioxol-5-yl}methylene)amino]-3-phenyl-5-sulfanyl-4H-1,2,4-triazole::MLS000544166::SMR000163712::cid_1205756
SMILES [O-][N+](=O)c1cc2OCOc2cc1[CH+][N-]n1c(n[nH]c1=S)-c1ccccc1
InChI Key InChIKey=RMGAOSOUCVYZNR-UHFFFAOYSA-N
Data  2 IC50
  Tab Delimited (TSV)   2D SDfile   Computed 3D by Vconf -m prep SDfile
Find this compound or compounds like it in BindingDB:
Activity Spreadsheet -- Enzyme Inhibition Constant Data from BindingDB
Found 2 hits for monomerid = 80145
TargetDNA dC->dU-editing enzyme APOBEC-3A(Homo sapiens (Human))
Burnham Center For Chemical Genomics
Curated by PubChem BioAssay
LigandPNGBDBM80145(4-[(6-nitro-1,3-benzodioxol-5-yl)methyleneamino]-3...)
Affinity DataIC50: >1.00E+5nMT: 2°C. Assay description: Data Source: Sanford-Burnham Center for Chemical Genomics (SBCCG) Source Affiliation: Sanford-Burnham Medical Research Institute (SBMRI, San Diego, C...
In DepthDetails PCBioAssay
TargetDNA dC->dU-editing enzyme APOBEC-3G(Homo sapiens (Human))
Burnham Center For Chemical Genomics
Curated by PubChem BioAssay
LigandPNGBDBM80145(4-[(6-nitro-1,3-benzodioxol-5-yl)methyleneamino]-3...)
Affinity DataIC50:  1.89E+3nMT: 2°C. Assay description: Data Source: Sanford-Burnham Center for Chemical Genomics (SBCCG) Source Affiliation: Sanford-Burnham Medical Research Institute (SBMRI, San Diego, C...
In DepthDetails PCBioAssay