BDBM80357 (3-acetyl-4-oxidoquinoxalin-4-ium-2-yl)methyl pyridine-3-carboxylate::(3-ethanoyl-4-oxidanidyl-quinoxalin-4-ium-2-yl)methyl pyridine-3-carboxylate::3-pyridinecarboxylic acid (3-acetyl-4-oxido-2-quinoxalin-4-iumyl)methyl ester::MLS000041994::SMR000046514::cid_665392::nicotinic acid (3-acetyl-4-oxido-quinoxalin-4-ium-2-yl)methyl ester
SMILES CC(=O)c1c(COC(=O)c2cccnc2)nc2ccccc2[n+]1[O-]
InChI Key InChIKey=KCRWYDLSCHKTSX-UHFFFAOYSA-N
Data  2 IC50
  Tab Delimited (TSV)   2D SDfile   Computed 3D by Vconf -m prep SDfile
Find this compound or compounds like it in BindingDB:
Activity Spreadsheet -- Enzyme Inhibition Constant Data from BindingDB
Found 2 hits for monomerid = 80357
TargetDNA dC->dU-editing enzyme APOBEC-3A(Homo sapiens (Human))
Burnham Center For Chemical Genomics
Curated by PubChem BioAssay
LigandPNGBDBM80357((3-acetyl-4-oxidoquinoxalin-4-ium-2-yl)methyl pyri...)
Affinity DataIC50:  1.48E+3nMT: 2°C. Assay description: Data Source: Sanford-Burnham Center for Chemical Genomics (SBCCG) Source Affiliation: Sanford-Burnham Medical Research Institute (SBMRI, San Diego, C...
In DepthDetails PCBioAssay
TargetDNA dC->dU-editing enzyme APOBEC-3G(Homo sapiens (Human))
Burnham Center For Chemical Genomics
Curated by PubChem BioAssay
LigandPNGBDBM80357((3-acetyl-4-oxidoquinoxalin-4-ium-2-yl)methyl pyri...)
Affinity DataIC50:  2.09E+3nMT: 2°C. Assay description: Data Source: Sanford-Burnham Center for Chemical Genomics (SBCCG) Source Affiliation: Sanford-Burnham Medical Research Institute (SBMRI, San Diego, C...
In DepthDetails PCBioAssay