BDBM80698 (5Z)-2-(p-tolyl)-5-vanillylidene-2-thiazolin-4-one::(5Z)-5-[(3-methoxy-4-oxidanyl-phenyl)methylidene]-2-(4-methylphenyl)-1,3-thiazol-4-one::(5Z)-5-[(4-hydroxy-3-methoxyphenyl)methylidene]-2-(4-methylphenyl)-1,3-thiazol-4-one::(5Z)-5-[(4-hydroxy-3-methoxyphenyl)methylidene]-2-(4-methylphenyl)-4-thiazolone::5-(4-hydroxy-3-methoxybenzylidene)-2-(4-methylphenyl)-1,3-thiazol-4(5H)-one::MLS000579809::SMR000186541::cid_2253319
SMILES COc1cc(\C=C2/SC(=NC2=O)c2ccc(C)cc2)ccc1O
InChI Key InChIKey=SYMWDHQZCMAQBC-YBEGLDIGSA-N
Data  6 IC50
  Tab Delimited (TSV)   2D SDfile   Computed 3D by Vconf -m prep SDfile
Find this compound or compounds like it in BindingDB:
Activity Spreadsheet -- Enzyme Inhibition Constant Data from BindingDB
Found 6 hits for monomerid = 80698
TargetHexokinase HKDC1 [W721R](Homo sapiens (Human))
Burnham Center For Chemical Genomics
Curated by PubChem BioAssay
LigandPNGBDBM80698((5Z)-2-(p-tolyl)-5-vanillylidene-2-thiazolin-4-one...)
Affinity DataIC50:  3.83E+4nM. Assay description: Data Source: Sanford-Burnham Center for Chemical Genomics (SBCCG) Source Affiliation: Sanford-Burnham Medical Research Institute (SBMRI, San Diego, C...
In DepthDetails PCBioAssay
TargetGlucose-6-phosphate 1-dehydrogenase(Homo sapiens (Human))
Burnham Center For Chemical Genomics
Curated by PubChem BioAssay
LigandPNGBDBM80698((5Z)-2-(p-tolyl)-5-vanillylidene-2-thiazolin-4-one...)
Affinity DataIC50: >8.00E+4nM. Assay description: Data Source: Sanford-Burnham Center for Chemical Genomics (SBCCG) Source Affiliation: Sanford-Burnham Medical Research Institute (SBMRI, San Diego CA...
In DepthDetails PCBioAssay
TargetGlucose-6-phosphate dehydrogenase-6-phosphogluconolactonase(Plasmodium falciparum 3D7)
Burnham Center For Chemical Genomics
Curated by PubChem BioAssay
LigandPNGBDBM80698((5Z)-2-(p-tolyl)-5-vanillylidene-2-thiazolin-4-one...)
Affinity DataIC50: >8.00E+4nM. Assay description: Data Source: Sanford-Burnham Center for Chemical Genomics (SBCCG) Source Affiliation: Sanford-Burnham Medical Research Institute (SBMRI, San Diego CA...
In DepthDetails PCBioAssay
TargetGlucose-6-phosphate dehydrogenase-6-phosphogluconolactonase(Plasmodium falciparum 3D7)
Burnham Center For Chemical Genomics
Curated by PubChem BioAssay
LigandPNGBDBM80698((5Z)-2-(p-tolyl)-5-vanillylidene-2-thiazolin-4-one...)
Affinity DataIC50:  8.70E+3nM. Assay description: Data Source: Sanford-Burnham Center for Chemical Genomics (SBCCG) Source Affiliation: Sanford-Burnham Medical Research Institute (SBMRI, San Diego CA...
In DepthDetails PCBioAssay
TargetGlucose-6-phosphate dehydrogenase-6-phosphogluconolactonase(Plasmodium falciparum 3D7)
Burnham Center For Chemical Genomics
Curated by PubChem BioAssay
LigandPNGBDBM80698((5Z)-2-(p-tolyl)-5-vanillylidene-2-thiazolin-4-one...)
Affinity DataIC50: >8.00E+4nM. Assay description: Data Source: Sanford-Burnham Center for Chemical Genomics (SBCCG) Source Affiliation: Sanford-Burnham Medical Research Institute (SBMRI, San Diego CA...
In DepthDetails PCBioAssay
TargetHexokinase HKDC1 [W721R](Homo sapiens (Human))
Burnham Center For Chemical Genomics
Curated by PubChem BioAssay
LigandPNGBDBM80698((5Z)-2-(p-tolyl)-5-vanillylidene-2-thiazolin-4-one...)
Affinity DataIC50:  8.00E+4nM. Assay description: Data Source: Sanford-Burnham Center for Chemical Genomics (SBCCG) Source Affiliation: Sanford-Burnham Medical Research Institute (SBMRI, San Diego, C...
In DepthDetails PCBioAssay