BDBM8094 (2S)-N-[(2S,3S)-4-{[(1S)-1-carbamoyl-2-(4-phenylphenyl)ethyl]amino}-3-hydroxy-1-phenylbutan-2-yl]-2-(furan-3-ylformamido)-3-methylbutanamide::hydroxylethylamine scaffold 64::hydroxylethylamine scaffold 6{4}
SMILES CC(C)[C@H](NC(=O)c1ccoc1)C(=O)N[C@@H](Cc1ccccc1)[C@@H](O)CN[C@@H](Cc1ccc(cc1)-c1ccccc1)C(N)=O
InChI Key InChIKey=JNSXGBTVDBWEQQ-YDPTYEFTSA-N
Data  3 KI
  Tab Delimited (TSV)   2D SDfile   Computed 3D by Vconf -m prep SDfile
Find this compound or compounds like it in BindingDB:
Activity Spreadsheet -- Enzyme Inhibition Constant Data from BindingDB
Found 3 hits for monomerid = 8094
TargetPlasmepsin I(Plasmodium falciparum)
Uppsala University
LigandPNGBDBM8094((2S)-N-[(2S,3S)-4-{[(1S)-1-carbamoyl-2-(4-phenylph...)
Affinity DataKi:  18nM. Assay description: Enzyme activities were assayed by monitoring the hydrolysis of substrate in the presence or absence of inhibitor compounds. The hydrolysis was record...
In DepthDetails ArticlePubMed
TargetPlasmepsin II(Plasmodium falciparum)
Uppsala University
LigandPNGBDBM8094((2S)-N-[(2S,3S)-4-{[(1S)-1-carbamoyl-2-(4-phenylph...)
Affinity DataKi:  57nM ΔG°:  -9.78kcal/molepH: 4.5 T: 2°C. Assay description: Enzyme activities were assayed by monitoring the hydrolysis of substrate in the presence or absence of inhibitor compounds. The hydrolysis was record...
In DepthDetails ArticlePubMed
TargetCathepsin D(Homo sapiens (Human))
Uppsala University
LigandPNGBDBM8094((2S)-N-[(2S,3S)-4-{[(1S)-1-carbamoyl-2-(4-phenylph...)
Affinity DataKi:  2.20E+3nM. Assay description: Enzyme activities were assayed by monitoring the hydrolysis of substrate in the presence or absence of inhibitor compounds. The hydrolysis was record...
In DepthDetails ArticlePubMed