BDBM80946 2-[[5-[(4-chloranylphenoxy)methyl]-4-(furan-2-ylmethyl)-1,2,4-triazol-3-yl]sulfanyl]-1-(2-fluorophenyl)ethanone::2-[[5-[(4-chlorophenoxy)methyl]-4-(2-furanylmethyl)-1,2,4-triazol-3-yl]thio]-1-(2-fluorophenyl)ethanone::2-[[5-[(4-chlorophenoxy)methyl]-4-(2-furfuryl)-1,2,4-triazol-3-yl]thio]-1-(2-fluorophenyl)ethanone::2-[[5-[(4-chlorophenoxy)methyl]-4-(furan-2-ylmethyl)-1,2,4-triazol-3-yl]sulfanyl]-1-(2-fluorophenyl)ethanone::MLS000879947::SMR000068286::cid_2547019
SMILES Fc1ccccc1C(=O)CSc1nnc(COc2ccc(Cl)cc2)n1Cc1ccco1
InChI Key InChIKey=GDKWCAREGHLWPB-UHFFFAOYSA-N
Data  2 IC50
  Tab Delimited (TSV)   2D SDfile   Computed 3D by Vconf -m prep SDfile
Find this compound or compounds like it in BindingDB:
Activity Spreadsheet -- Enzyme Inhibition Constant Data from BindingDB
Found 2 hits for monomerid = 80946
TargetPhospholipase A2(Homo sapiens (Human))
Burnham Center For Chemical Genomics
Curated by PubChem BioAssay
LigandPNGBDBM80946(2-[[5-[(4-chloranylphenoxy)methyl]-4-(furan-2-ylme...)
Affinity DataIC50:  5.57E+4nM. Assay description: Data Source: Sanford-Burnham Center for Chemical Genomics (SBCCG) Source Affiliation: Sanford-Burnham Medical Research Institute (SBMRI, San Diego, C...
In DepthDetails PCBioAssay
TargetCysteine protease ATG4B(Homo sapiens (Human))
Burnham Center For Chemical Genomics
Curated by PubChem BioAssay
LigandPNGBDBM80946(2-[[5-[(4-chloranylphenoxy)methyl]-4-(furan-2-ylme...)
Affinity DataIC50:  2.36E+3nM. Assay description: Data Source: Sanford-Burnham Center for Chemical Genomics (SBCCG) Source Affiliation: Sanford-Burnham Medical Research Institute (SBMRI, San Diego, C...
In DepthDetails PCBioAssay