BDBM81005 1,3-benzodioxol-5-yl(4-pyridylmethyl)amine::MLS000057677::N-(pyridin-4-ylmethyl)-1,3-benzodioxol-5-amine::SMR000067770::cid_1087209
SMILES C(Nc1ccc2OCOc2c1)c1ccncc1
InChI Key InChIKey=DTUPPQJARLKFDB-UHFFFAOYSA-N
Data  7 IC50
  Tab Delimited (TSV)   2D SDfile   Computed 3D by Vconf -m prep SDfile
Find this compound or compounds like it in BindingDB:
Activity Spreadsheet -- Enzyme Inhibition Constant Data from BindingDB
Found 7 hits for monomerid = 81005
TargetGlucose-6-phosphate 1-dehydrogenase(Homo sapiens (Human))
Burnham Center For Chemical Genomics
Curated by PubChem BioAssay
LigandPNGBDBM81005(1,3-benzodioxol-5-yl(4-pyridylmethyl)amine | MLS00...)
Affinity DataIC50: >8.00E+4nM. Assay description: Data Source: Sanford-Burnham Center for Chemical Genomics (SBCCG) Source Affiliation: Sanford-Burnham Medical Research Institute (SBMRI, San Diego CA...
In DepthDetails PCBioAssay
TargetGlucose-6-phosphate dehydrogenase-6-phosphogluconolactonase(Plasmodium falciparum 3D7)
Burnham Center For Chemical Genomics
Curated by PubChem BioAssay
LigandPNGBDBM81005(1,3-benzodioxol-5-yl(4-pyridylmethyl)amine | MLS00...)
Affinity DataIC50:  2.53E+4nM. Assay description: Data Source: Sanford-Burnham Center for Chemical Genomics (SBCCG) Source Affiliation: Sanford-Burnham Medical Research Institute (SBMRI, San Diego CA...
In DepthDetails PCBioAssay
TargetGlucose-6-phosphate dehydrogenase-6-phosphogluconolactonase(Plasmodium falciparum 3D7)
Burnham Center For Chemical Genomics
Curated by PubChem BioAssay
LigandPNGBDBM81005(1,3-benzodioxol-5-yl(4-pyridylmethyl)amine | MLS00...)
Affinity DataIC50: >8.00E+4nM. Assay description: Data Source: Sanford-Burnham Center for Chemical Genomics (SBCCG) Source Affiliation: Sanford-Burnham Medical Research Institute (SBMRI, San Diego CA...
In DepthDetails PCBioAssay
TargetNeuropilin-1(Homo sapiens (Human))
Burnham Center For Chemical Genomics
Curated by PubChem BioAssay
LigandPNGBDBM81005(1,3-benzodioxol-5-yl(4-pyridylmethyl)amine | MLS00...)
Affinity DataIC50: >9.50E+4nM
In DepthDetails PCBioAssay
TargetPolyadenylate-binding protein 1(Homo sapiens (Human))
Burnham Center For Chemical Genomics
Curated by PubChem BioAssay
LigandPNGBDBM81005(1,3-benzodioxol-5-yl(4-pyridylmethyl)amine | MLS00...)
Affinity DataIC50:  2.35E+4nM. Assay description: Data Source: Sanford-Burnham Center for Chemical Genomics (SBCCG) Source Affiliation: Sanford-Burnham Medical Research Institute (SBMRI, San Diego, C...
In DepthDetails PCBioAssay
TargetPolyadenylate-binding protein 1(Homo sapiens (Human))
Burnham Center For Chemical Genomics
Curated by PubChem BioAssay
LigandPNGBDBM81005(1,3-benzodioxol-5-yl(4-pyridylmethyl)amine | MLS00...)
Affinity DataIC50: >6.60E+4nM. Assay description: Data Source: Sanford-Burnham Center for Chemical Genomics (SBCCG) Source Affiliation: Sanford-Burnham Medical Research Institute (SBMRI, San Diego, C...
In DepthDetails PCBioAssay
TargetGlucose-6-phosphate dehydrogenase-6-phosphogluconolactonase(Plasmodium falciparum 3D7)
Burnham Center For Chemical Genomics
Curated by PubChem BioAssay
LigandPNGBDBM81005(1,3-benzodioxol-5-yl(4-pyridylmethyl)amine | MLS00...)
Affinity DataIC50: >8.00E+4nM. Assay description: Data Source: Sanford-Burnham Center for Chemical Genomics (SBCCG) Source Affiliation: Sanford-Burnham Medical Research Institute (SBMRI, San Diego CA...
In DepthDetails PCBioAssay