BDBM81072 2-(4,6-dimethylquinolin-2-yl)sulfanyl-N-(furan-2-ylmethylideneamino)acetamide::2-(4,6-dimethylquinolin-2-yl)sulfanyl-N-(furan-2-ylmethylideneamino)ethanamide::2-[(4,6-dimethyl-2-quinolinyl)thio]-N-(2-furanylmethylideneamino)acetamide::2-[(4,6-dimethyl-2-quinolyl)thio]-N-(2-furfurylideneamino)acetamide::MLS000717854::SMR000279422::cid_830047
SMILES Cc1ccc2nc(SCC(=O)NN=Cc3ccco3)cc(C)c2c1
InChI Key InChIKey=CPYTXWFFFQKUDP-UHFFFAOYSA-N
Data  4 IC50
  Tab Delimited (TSV)   2D SDfile   Computed 3D by Vconf -m prep SDfile
Find this compound or compounds like it in BindingDB:
Activity Spreadsheet -- Enzyme Inhibition Constant Data from BindingDB
Found 4 hits for monomerid = 81072
TargetGlucose-6-phosphate 1-dehydrogenase(Homo sapiens (Human))
Burnham Center For Chemical Genomics
Curated by PubChem BioAssay
LigandPNGBDBM81072(2-(4,6-dimethylquinolin-2-yl)sulfanyl-N-(furan-2-y...)
Affinity DataIC50:  4.18E+4nM. Assay description: Data Source: Sanford-Burnham Center for Chemical Genomics (SBCCG) Source Affiliation: Sanford-Burnham Medical Research Institute (SBMRI, San Diego CA...
In DepthDetails PCBioAssay
TargetGlucose-6-phosphate dehydrogenase-6-phosphogluconolactonase(Plasmodium falciparum 3D7)
Burnham Center For Chemical Genomics
Curated by PubChem BioAssay
LigandPNGBDBM81072(2-(4,6-dimethylquinolin-2-yl)sulfanyl-N-(furan-2-y...)
Affinity DataIC50: >8.00E+4nM. Assay description: Data Source: Sanford-Burnham Center for Chemical Genomics (SBCCG) Source Affiliation: Sanford-Burnham Medical Research Institute (SBMRI, San Diego CA...
In DepthDetails PCBioAssay
TargetGlucose-6-phosphate dehydrogenase-6-phosphogluconolactonase(Plasmodium falciparum 3D7)
Burnham Center For Chemical Genomics
Curated by PubChem BioAssay
LigandPNGBDBM81072(2-(4,6-dimethylquinolin-2-yl)sulfanyl-N-(furan-2-y...)
Affinity DataIC50: >8.00E+4nM. Assay description: Data Source: Sanford-Burnham Center for Chemical Genomics (SBCCG) Source Affiliation: Sanford-Burnham Medical Research Institute (SBMRI, San Diego CA...
In DepthDetails PCBioAssay
TargetGlucose-6-phosphate dehydrogenase-6-phosphogluconolactonase(Plasmodium falciparum 3D7)
Burnham Center For Chemical Genomics
Curated by PubChem BioAssay
LigandPNGBDBM81072(2-(4,6-dimethylquinolin-2-yl)sulfanyl-N-(furan-2-y...)
Affinity DataIC50:  1.03E+4nM. Assay description: Data Source: Sanford-Burnham Center for Chemical Genomics (SBCCG) Source Affiliation: Sanford-Burnham Medical Research Institute (SBMRI, San Diego CA...
In DepthDetails PCBioAssay