BDBM8132 N-[4-(butan-2-yl)phenyl]-4-{pyrazolo[1,5-a]pyridazin-3-yl}pyrimidin-2-amine::pyrazolo[1,5-b]pyridazine deriv. 23
SMILES CCC(C)c1ccc(Nc2nccc(n2)-c2cnn3ncccc23)cc1
InChI Key InChIKey=YRGZDNHXSLVEOX-UHFFFAOYSA-N
Data  3 IC50
  Tab Delimited (TSV)   2D SDfile   Computed 3D by Vconf -m prep SDfile
Find this compound or compounds like it in BindingDB:
Activity Spreadsheet -- Enzyme Inhibition Constant Data from BindingDB
Found 3 hits for monomerid = 8132
TargetCyclin-A2/Cyclin-dependent kinase 2(Homo sapiens (Human))
Glaxosmithkline
LigandPNGBDBM8132(N-[4-(butan-2-yl)phenyl]-4-{pyrazolo[1,5-a]pyridaz...)
Affinity DataIC50:  158nMpH: 7.2 T: 2°C. Assay description: The biochemical activity of compounds was determined by incubation with specific enzyme and substrate in the presence 2.5 uM ATP/ [gamma-32P] ATP. Af...
In DepthDetails ArticlePubMed
TargetCyclin-dependent kinase 4/G1/S-specific cyclin-D1(Homo sapiens (Human))
Glaxosmithkline
LigandPNGBDBM8132(N-[4-(butan-2-yl)phenyl]-4-{pyrazolo[1,5-a]pyridaz...)
Affinity DataIC50:  316nM. Assay description: The biochemical activity of compounds was determined by incubation with specific enzyme and substrate in the presence 2.5 uM ATP/ [gamma-32P] ATP. Af...
In DepthDetails ArticlePubMed
TargetGlycogen synthase kinase-3 beta(Homo sapiens (Human))
Glaxosmithkline
LigandPNGBDBM8132(N-[4-(butan-2-yl)phenyl]-4-{pyrazolo[1,5-a]pyridaz...)
Affinity DataIC50:  125nM. Assay description: The biochemical activity of compounds was determined by incubation with specific enzyme and substrate in the presence 2.5 uM ATP/ [gamma-32P] ATP. Af...
In DepthDetails ArticlePubMed