BDBM81370 SW14
SMILES Cc1ccccc1-n1c(Cn2nc(-c3ccc(O)c(F)c3)c3c(N)cccc23)nc2cccc(C)c2c1=O
InChI Key InChIKey=XOKZXNOZHXOLDH-UHFFFAOYSA-N
Data  4 IC50
  Tab Delimited (TSV)   2D SDfile   Computed 3D by Vconf -m prep SDfile
Find this compound or compounds like it in BindingDB:
Activity Spreadsheet -- Enzyme Inhibition Constant Data from BindingDB
Found 4 hits for monomerid = 81370
TargetPhosphatidylinositol 4,5-bisphosphate 3-kinase catalytic subunit alpha isoform(Homo sapiens (Human))
University Of California San Francisco
LigandPNGBDBM81370(SW14)
Affinity DataIC50:  8.91E+3nM. Assay description: Biochemical assay using PI3Ks and diversification of tolyl quinazolinone series.
In DepthDetails ArticlePubMed
TargetPhosphatidylinositol 4,5-bisphosphate 3-kinase catalytic subunit gamma isoform(Homo sapiens (Human))
University Of California San Francisco
LigandPNGBDBM81370(SW14)
Affinity DataIC50:  21nM. Assay description: Biochemical assay using PI3Ks and diversification of tolyl quinazolinone series.
In DepthDetails ArticlePubMed
TargetPhosphatidylinositol 4,5-bisphosphate 3-kinase catalytic subunit delta isoform(Homo sapiens (Human))
University Of California San Francisco
LigandPNGBDBM81370(SW14)
Affinity DataIC50:  9nM. Assay description: Biochemical assay using PI3Ks and diversification of tolyl quinazolinone series.
In DepthDetails ArticlePubMed
TargetPhosphatidylinositol 4,5-bisphosphate 3-kinase catalytic subunit beta isoform(Homo sapiens (Human))
University Of California San Francisco
LigandPNGBDBM81370(SW14)
Affinity DataIC50:  697nM. Assay description: Biochemical assay using PI3Ks and diversification of tolyl quinazolinone series.
In DepthDetails ArticlePubMed