BDBM81403 HN3019
SMILES CCCCC(C(=O)COc1c(F)c(F)cc(F)c1F)n1cc(nn1)C1(N)CCCCC1
InChI Key InChIKey=CNJCQTRHYGOMQC-UHFFFAOYSA-N
Data  1 IC50
  Tab Delimited (TSV)   2D SDfile   Computed 3D by Vconf -m prep SDfile
Find this compound or compounds like it in BindingDB:
Activity Spreadsheet -- Enzyme Inhibition Constant Data from BindingDB
Found 1 hit for monomerid = 81403
TargetDipeptidyl peptidase 1(Mus musculus)
Stanford School Of Medicine
LigandPNGBDBM81403(HN3019)
Affinity DataIC50:  560nM. Assay description: DPAP1 inhibtion was measured using DPAP1-specific fluorogenic assay. IC50 DPAP1 were determined after 30 min incubation of parasite lysates with 5 n...
In DepthDetails ArticlePubMed