BDBM81660 4,5-Dihydro-(1H)-pyrazole derivative, 3d
SMILES CC(=O)N1CCC(=N1)c1ccc(Br)cc1
InChI Key InChIKey=HXYCOMWEFPNMSP-UHFFFAOYSA-N
Data  2 IC50
  Tab Delimited (TSV)   2D SDfile   Computed 3D by Vconf -m prep SDfile
Find this compound or compounds like it in BindingDB:
Activity Spreadsheet -- Enzyme Inhibition Constant Data from BindingDB
Found 2 hits for monomerid = 81660
TargetAmine oxidase [flavin-containing] B(Homo sapiens (Human))
UniversitÀ
LigandPNGBDBM81660(4,5-Dihydro-(1H)-pyrazole derivative, 3d)
Affinity DataIC50:  1.00E+5nM. Assay description: Monoamine oxidase inhibitory activity of derivatives of 4, dihydro-(1H)-pyrazole.
In DepthDetails ArticlePubMed
TargetAmine oxidase [flavin-containing] A(Homo sapiens (Human))
UniversitÀ
LigandPNGBDBM81660(4,5-Dihydro-(1H)-pyrazole derivative, 3d)
Affinity DataIC50:  10nM. Assay description: Monoamine oxidase inhibitory activity of derivatives of 4, dihydro-(1H)-pyrazole.
In DepthDetails ArticlePubMed