BDBM81722 2,6,9-Trisubstituted Purine, 9
SMILES CCn1cnc2c(Nc3ccc(cc3)P(O)(=O)CP(O)(O)=O)nc(C[C@H]3CC[C@H](N)CC3)nc12
InChI Key InChIKey=TVAXCYIGFNXSHG-SHTZXODSSA-N
Data  1 IC50
  Tab Delimited (TSV)   2D SDfile   Computed 3D by Vconf -m prep SDfile
Find this compound or compounds like it in BindingDB:
Activity Spreadsheet -- Enzyme Inhibition Constant Data from BindingDB
Found 1 hit for monomerid = 81722
TargetProto-oncogene tyrosine-protein kinase Src(Mus musculus (Mouse))
Ariad Pharmaceuticals
LigandPNGBDBM81722(2,6,9-Trisubstituted Purine, 9)
Affinity DataIC50:  205nM. Assay description: 2,6,9-Trisubstituted purines were evaluated for their src kinase inhibitory activities using an ELISA assay.
In DepthDetails ArticlePubMed