BDBM81752 Chembridge No 9035650, Class 2, 12
SMILES COc1ccc(cc1)C(=O)N1CCN(CC1)c1oc(nc1C#N)-c1ccccc1
InChI Key InChIKey=GQDZVLACUSLKAM-UHFFFAOYSA-N
Data  2 IC50
  Tab Delimited (TSV)   2D SDfile   Computed 3D by Vconf -m prep SDfile
Find this compound or compounds like it in BindingDB:
Activity Spreadsheet -- Enzyme Inhibition Constant Data from BindingDB
Found 2 hits for monomerid = 81752
TargetTubulin alpha-1A chain(Sus scrofa (Pig))
The Ohio State University
LigandPNGBDBM81752(Chembridge No 9035650, Class 2, 12)
Affinity DataIC50:  6.10E+4nM. Assay description: In vitro activity assay using leishmania tarentolae and porcine brain tubulin.
In DepthDetails ArticlePubMed
TargetTubulin alpha chain(Leishmania tarentolae (Sauroleishmania tarentolae))
The Ohio State University
LigandPNGBDBM81752(Chembridge No 9035650, Class 2, 12)
Affinity DataIC50:  6.60E+4nM. Assay description: In vitro activity assay using leishmania tarentolae and porcine brain tubulin.
In DepthDetails ArticlePubMed