BDBM8176 N-(2,3-dihydro-1,4-benzodioxin-6-yl)-4-[2-(4-fluorophenyl)pyrazolo[1,5-a]pyridazin-3-yl]pyrimidin-2-amine::pyrazolo[1,5-b]pyridazine deriv. 67
SMILES Fc1ccc(cc1)-c1nn2ncccc2c1-c1ccnc(Nc2ccc3OCCOc3c2)n1
InChI Key InChIKey=VCIUEFSUNSUNPA-UHFFFAOYSA-N
Data  2 IC50
  Tab Delimited (TSV)   2D SDfile   Computed 3D by Vconf -m prep SDfile
Find this compound or compounds like it in BindingDB:
Activity Spreadsheet -- Enzyme Inhibition Constant Data from BindingDB
Found 2 hits for monomerid = 8176
TargetGlycogen synthase kinase-3 beta(Homo sapiens (Human))
Glaxosmithkline
LigandPNGBDBM8176(N-(2,3-dihydro-1,4-benzodioxin-6-yl)-4-[2-(4-fluor...)
Affinity DataIC50:  10nM. Assay description: The biochemical activity of compounds was determined by incubation with specific enzyme and substrate in the presence 2.5 uM ATP/ [gamma-32P] ATP. Af...
In DepthDetails ArticlePubMed
TargetCyclin-A2/Cyclin-dependent kinase 2(Homo sapiens (Human))
Glaxosmithkline
LigandPNGBDBM8176(N-(2,3-dihydro-1,4-benzodioxin-6-yl)-4-[2-(4-fluor...)
Affinity DataIC50: >2.00E+4nM. Assay description: The biochemical activity of compounds was determined by incubation with specific enzyme and substrate in the presence 2.5 uM ATP/ [gamma-32P] ATP. Af...
In DepthDetails ArticlePubMed