BDBM8183 N-[3-(trifluoromethyl)phenyl]-4-{2-[4-(trifluoromethyl)phenyl]pyrazolo[1,5-a]pyridazin-3-yl}pyrimidin-2-amine::pyrazolo[1,5-b]pyridazine deriv. 74
SMILES FC(F)(F)c1ccc(cc1)-c1nn2ncccc2c1-c1ccnc(Nc2cccc(c2)C(F)(F)F)n1
InChI Key InChIKey=QAZNLJCWSKKTPV-UHFFFAOYSA-N
Data  2 IC50
  Tab Delimited (TSV)   2D SDfile   Computed 3D by Vconf -m prep SDfile
Find this compound or compounds like it in BindingDB:
Activity Spreadsheet -- Enzyme Inhibition Constant Data from BindingDB
Found 2 hits for monomerid = 8183
TargetGlycogen synthase kinase-3 beta(Homo sapiens (Human))
Glaxosmithkline
LigandPNGBDBM8183(N-[3-(trifluoromethyl)phenyl]-4-{2-[4-(trifluorome...)
Affinity DataIC50: >3.16E+4nM. Assay description: The biochemical activity of compounds was determined by incubation with specific enzyme and substrate in the presence 2.5 uM ATP/ [gamma-32P] ATP. Af...
In DepthDetails ArticlePubMed
TargetCyclin-A2/Cyclin-dependent kinase 2(Homo sapiens (Human))
Glaxosmithkline
LigandPNGBDBM8183(N-[3-(trifluoromethyl)phenyl]-4-{2-[4-(trifluorome...)
Affinity DataIC50: >2.00E+4nM. Assay description: The biochemical activity of compounds was determined by incubation with specific enzyme and substrate in the presence 2.5 uM ATP/ [gamma-32P] ATP. Af...
In DepthDetails ArticlePubMed