BDBM81867 N-Substituted indole-2- and 3-carboxamide derivative, 17
SMILES Fc1ccc(Cn2cc(C(=O)NCc3ccc(Cl)cc3)c3ccccc23)cc1
InChI Key InChIKey=PWPVOJQPTAGOCW-UHFFFAOYSA-N
Data  2 IC50
  Tab Delimited (TSV)   2D SDfile   Computed 3D by Vconf -m prep SDfile
Find this compound or compounds like it in BindingDB:
Activity Spreadsheet -- Enzyme Inhibition Constant Data from BindingDB
Found 2 hits for monomerid = 81867
TargetHyaluronidase-1(Homo sapiens (Human))
TBA
LigandPNGBDBM81867(N-Substituted indole-2- and 3-carboxamide derivati...)
Affinity DataIC50:  7.29E+4nMpH: 3.5 T: 2°C. Assay description: Morgan-elson assay were used to test inhibitors at pH of 3.5.
In DepthDetails ArticlePubMed
TargetHyaluronidase-1(Homo sapiens (Human))
TBA
LigandPNGBDBM81867(N-Substituted indole-2- and 3-carboxamide derivati...)
Affinity DataIC50:  3.37E+4nMpH: 7.0 T: 2°C. Assay description: Stains-all assay were used to test inhibitors at pH of 7.
In DepthDetails ArticlePubMed