BDBM8218 3-phenyl-4-(phenylamino)-2,5-dihydro-1H-pyrrole-2,5-dione::4-arylmaleimide deriv. 6a
SMILES O=C1NC(=O)C(=C1Nc1ccccc1)c1ccccc1
InChI Key InChIKey=ACQZMAJVOPRMQJ-UHFFFAOYSA-N
Data  3 IC50
  Tab Delimited (TSV)   2D SDfile   Computed 3D by Vconf -m prep SDfile
Find this compound or compounds like it in BindingDB:
Activity Spreadsheet -- Enzyme Inhibition Constant Data from BindingDB
Found 3 hits for monomerid = 8218
TargetGlycogen synthase kinase-3 alpha(Homo sapiens (Human))
Smithkline Beecham Pharmaceuticals
LigandPNGBDBM8218(3-phenyl-4-(phenylamino)-2,5-dihydro-1H-pyrrole-2,...)
Affinity DataIC50:  529nMpH: 7.0 T: 2°C. Assay description: The biochemical activity of compounds was determined by incubation with specific enzyme and substrate in the presence 10 uM ATP/ [gamma-33P] ATP. Aft...
In DepthDetails ArticlePubMed
TargetGlycogen synthase kinase-3 beta(Homo sapiens (Human))
University Of Jordan
Curated by ChEMBL
LigandPNGBDBM8218(3-phenyl-4-(phenylamino)-2,5-dihydro-1H-pyrrole-2,...)
Affinity DataIC50:  590nM. Assay description: Inhibition of recombinant GSK3-beta
In DepthDetails ArticlePubMed
TargetGlycogen synthase kinase-3 beta(Homo sapiens (Human))
University Of Jordan
Curated by ChEMBL
LigandPNGBDBM8218(3-phenyl-4-(phenylamino)-2,5-dihydro-1H-pyrrole-2,...)
Affinity DataIC50:  520nM. Assay description: Inhibition of human GSK3-beta
In DepthDetails ArticlePubMed