BDBM82189 Salicylic acid derivative, 76B8
SMILES OC(=O)c1ccc(o1)-c1ccc(O)c(c1)C(O)=O
InChI Key InChIKey=IMCGUYIXYODOKI-UHFFFAOYSA-N
Data  1 IC50
  Tab Delimited (TSV)   2D SDfile   Computed 3D by Vconf -m prep SDfile
Find this compound or compounds like it in BindingDB:
Activity Spreadsheet -- Enzyme Inhibition Constant Data from BindingDB
Found 1 hit for monomerid = 82189
TargetEphrin type-A receptor 4 [1-949,A922V](Homo sapiens (Human))
Sanford-Burnham Medical Research Institute
LigandPNGBDBM82189(Salicylic acid derivative, 76B8)
Affinity DataIC50: >5.00E+5nMpH: 7.5Assay Description:Protein A-coasted wells (from Pierce Biotechnology) were used to immobilize Eph receptor Fc fusion proteins (from R&D systems)incubated at 1 ug/ml in...
Ligand InfoPC cidPC sid
In DepthDetails ArticlePubMed