BDBM82196 Substrate analogue, 14
SMILES NCC(=O)OCC(O)=O
InChI Key InChIKey=JKYHTVIGJFKHAN-UHFFFAOYSA-N
Data  1 KI
  Tab Delimited (TSV)   2D SDfile   Computed 3D by Vconf -m prep SDfile
Find this compound or compounds like it in BindingDB:
Activity Spreadsheet -- Enzyme Inhibition Constant Data from BindingDB
Found 1 hit for monomerid = 82196
TargetDelta-aminolevulinic acid dehydratase(Escherichia coli)
University Of NeuchÂTel
LigandPNGBDBM82196(Substrate analogue, 14)
Affinity DataKi:  1.82E+7nM ΔG°:  -2.47kcal/molepH: 8.1 T: 2°C. Assay description: The PBGS assay is a colorimetric assay based on the reaction between PBG and 4-dimethylaminobenzaldehyde (Ehrlich's reagent).
In DepthDetails ArticlePubMed