BDBM8221 3-(3-nitrophenyl)-4-(phenylamino)-2,5-dihydro-1H-pyrrole-2,5-dione::4-arylmaleimide deriv. 6d
SMILES O=C1NC(=O)C(=C1Nc1ccccc1)c1cccc(c1)N(=O)=O
InChI Key InChIKey=JZNQVKNWCJMHKJ-UHFFFAOYSA-N
Data  1 IC50
  Tab Delimited (TSV)   2D SDfile   Computed 3D by Vconf -m prep SDfile
Find this compound or compounds like it in BindingDB:
Activity Spreadsheet -- Enzyme Inhibition Constant Data from BindingDB
Found 1 hit for monomerid = 8221
TargetGlycogen synthase kinase-3 alpha(Homo sapiens (Human))
Smithkline Beecham Pharmaceuticals
LigandPNGBDBM8221(3-(3-nitrophenyl)-4-(phenylamino)-2,5-dihydro-1H-p...)
Affinity DataIC50:  141nMpH: 7.0 T: 2°C. Assay description: The biochemical activity of compounds was determined by incubation with specific enzyme and substrate in the presence 10 uM ATP/ [gamma-33P] ATP. Aft...
In DepthDetails ArticlePubMed