BDBM82299 PYY Pro34, Human
SMILES CCC(C)[C@H](NC(=O)[C@@H]1CCCN1C(=O)[C@@H](N)Cc1ccc(O)cc1)C(=O)N[C@@H](CCCCN)C(=O)N1CCC[C@H]1C(=O)N[C@@H](CCC(O)=O)C(=O)N[C@@H](C)C(=O)N1CCC[C@H]1C(=O)NCC(=O)N[C@@H](CCC(O)=O)C(=O)N[C@@H](CC(O)=O)C(=O)N[C@@H](C)C(=O)N[C@@H](CO)C(=O)N1CCC[C@H]1C(=O)N[C@@H](CCC(O)=O)C(=O)N[C@@H](CCC(O)=O)C(=O)N[C@@H](CC(C)C)C(=O)N[C@@H](CC(N)=O)C(=O)N[C@@H](CCCN=C(N)N)C(=O)N[C@@H](Cc1ccc(O)cc1)C(=O)N[C@@H](Cc1ccc(O)cc1)C(=O)N[C@@H](C)C(=O)N[C@@H](CO)C(=O)N[C@@H](CC(C)C)C(=O)N[C@@H](CCCN=C(N)N)C(=O)N[C@@H](Cc1c[nH]cn1)C(=O)N[C@@H](Cc1ccc(O)cc1)C(=O)N[C@@H](CC(C)C)C(=O)N[C@@H](CC(N)=O)C(=O)N[C@@H](CC(C)C)C(=O)N[C@@H](C(C)C)C(=O)N[C@@H]([C@@H](C)O)C(=O)N[C@@H](CCCN=C(N)N)C(=O)N1CCC[C@H]1C(=O)N[C@@H](CCCN=C(N)N)C(=O)N[C@@H](Cc1ccc(O)cc1)C(O)=O
InChI Key InChIKey=VOOQPKANMDDBKV-UACNEJQVSA-N
Data  5 KI
  Tab Delimited (TSV)   2D SDfile   Computed 3D by Vconf -m prep SDfile
Find this compound or compounds like it in BindingDB:
Activity Spreadsheet -- Enzyme Inhibition Constant Data from BindingDB
Found 5 hits for monomerid = 82299
TargetNeuropeptide Y receptor type 1(Homo sapiens (Human))
Synaptic Pharmaceutical
Curated by PDSP Ki Database
LigandPNGBDBM82299(PYY Pro34, Human)
Affinity DataKi:  0.140nM
In DepthDetails ArticlePubMed
TargetNeuropeptide Y receptor type 1(Homo sapiens (Human))
Synaptic Pharmaceutical
Curated by PDSP Ki Database
LigandPNGBDBM82299(PYY Pro34, Human)
Affinity DataKi:  0.140nM
In DepthDetails PubMed
TargetPro-neuropeptide Y(Homo sapiens (Human))
Amgen
Curated by PDSP Ki Database
LigandPNGBDBM82299(PYY Pro34, Human)
Affinity DataKi:  4.60nM
In DepthDetails ArticlePubMed
TargetPro-neuropeptide Y(RAT)
Amgen
Curated by PDSP Ki Database
LigandPNGBDBM82299(PYY Pro34, Human)
Affinity DataKi:  7.40nM
In DepthDetails ArticlePubMed
TargetNeuropeptide Y receptor type 2(Homo sapiens (Human))
Synaptic Pharmaceutical
Curated by PDSP Ki Database
LigandPNGBDBM82299(PYY Pro34, Human)
Affinity DataKi:  1.00E+3nM
In DepthDetails PubMed