BDBM82395 [Phe1]VIP
SMILES [#6]-[#6]-[#6](-[#6])-[#6](-[#7]-[#6](=O)-[#6](-[#6]-[#8])-[#7]-[#6](=O)-[#6](-[#6]-[#6](-[#7])=O)-[#7]-[#6](=O)-[#6](-[#6]-[#6](-[#6])-[#6])-[#7]-[#6](=O)-[#6](-[#6]-c1ccc(-[#8])cc1)-[#7]-[#6](=O)-[#6](-[#6]-[#6]-[#6]-[#6]-[#7])-[#7]-[#6](=O)-[#6](-[#6]-[#6]-[#6]-[#6]-[#7])-[#7]-[#6](=O)-[#6](-[#7]-[#6](=O)-[#6](-[#6])-[#7]-[#6](=O)-[#6](-[#6]-[#6]-[#16]-[#6])-[#7]-[#6](=O)-[#6](-[#6]-[#6]-[#6](-[#7])=O)-[#7]-[#6](=O)-[#6](-[#6]-[#6]-[#6]-[#6]-[#7])-[#7]-[#6](=O)-[#6](-[#6]-[#6]-[#6]\[#7]=[#6](\[#7])-[#7])-[#7]-[#6](=O)-[#6](-[#6]-[#6](-[#6])-[#6])-[#7]-[#6](=O)-[#6](-[#6]-[#6]-[#6]\[#7]=[#6](\[#7])-[#7])-[#7]-[#6](=O)-[#6](-[#7]-[#6](=O)-[#6](-[#6]-c1ccc(-[#8])cc1)-[#7]-[#6](=O)-[#6](-[#6]-[#6](-[#7])=O)-[#7]-[#6](=O)-[#6](-[#6]-[#6](-[#8])=O)-[#7]-[#6](=O)-[#6](-[#7]-[#6](=O)-[#6](-[#6]-c1ccccc1)-[#7]-[#6](=O)-[#6](-[#7]-[#6](=O)-[#6](-[#6])-[#7]-[#6](=O)-[#6](-[#6]-[#6](-[#8])=O)-[#7]-[#6](=O)-[#6](-[#6]-[#8])-[#7]-[#6](=O)-[#6](-[#7])-[#6]-c1ccccc1)-[#6](-[#6])-[#6])-[#6](-[#6])-[#8])-[#6](-[#6])-[#8])-[#6](-[#6])-[#6])-[#6](=O)-[#7]-[#6](-[#6]-[#6](-[#6])-[#6])-[#6](=O)-[#7]-[#6](-[#6]-[#6](-[#7])=O)-[#6](-[#8])=O
InChI Key InChIKey=FBTKHFOMXQEOKC-UHFFFAOYSA-N
Data  1 KI
  Tab Delimited (TSV)   2D SDfile   Computed 3D by Vconf -m prep SDfile
Find this compound or compounds like it in BindingDB:
Activity Spreadsheet -- Enzyme Inhibition Constant Data from BindingDB
Found 1 hit for monomerid = 82395
TargetVIP peptides(RAT)
UniversitÉ
Curated by PDSP Ki Database
LigandPNGBDBM82395([Phe1]VIP)
Affinity DataKi:  30nM
In DepthDetails ArticlePubMed