BDBM82485 TMQ, N-benzyl
SMILES COc1cc(CC2N(Cc3ccccc3)CCc3cc(O)c(O)cc23)cc(OC)c1OC
InChI Key InChIKey=KQHZCEHMSOQMKM-UHFFFAOYSA-N
Data  1 KI
  Tab Delimited (TSV)   2D SDfile   Computed 3D by Vconf -m prep SDfile
Find this compound or compounds like it in BindingDB:
Activity Spreadsheet -- Enzyme Inhibition Constant Data from BindingDB
Found 1 hit for monomerid = 82485
TargetBeta-1 adrenergic receptor(GUINEA PIG)
Ohio State University
Curated by PDSP Ki Database
LigandPNGBDBM82485(TMQ, N-benzyl)
Affinity DataKi:  1.10E+3nM
In DepthDetails PubMed