BDBM8302 5-phenyl-1H-pyrazolo[3,4-c]pyridin-3-amine::pyrazolopyridine deriv. 5
SMILES Nc1n[nH]c2cnc(cc12)-c1ccccc1
InChI Key InChIKey=LZRFNYHUQSRPCO-UHFFFAOYSA-N
Data  2 IC50  1 Kd
  Tab Delimited (TSV)   2D SDfile   Computed 3D by Vconf -m prep SDfile
Find this compound or compounds like it in BindingDB:
Activity Spreadsheet -- Enzyme Inhibition Constant Data from BindingDB
Found 3 hits for monomerid = 8302
TargetGlycogen synthase kinase-3 alpha(Homo sapiens (Human))
Glaxosmithkline
LigandPNGBDBM8302(5-phenyl-1H-pyrazolo[3,4-c]pyridin-3-amine | pyraz...)
Affinity DataIC50:  1.26E+3nMpH: 7.0 T: 2°C. Assay description: The biochemical activity of compounds was determined by incubation with specific enzyme and substrate in the presence 10 uM ATP/ [gamma-33P] ATP. Aft...
In DepthDetails ArticlePubMed
TargetVenus kinase receptor 2(Schistosoma mansoni)
Imperial College London
Curated by ChEMBL
LigandPNGBDBM8302(5-phenyl-1H-pyrazolo[3,4-c]pyridin-3-amine | pyraz...)
Affinity DataKd:  4.70E+4nM. Assay description: Binding affinity to Schistosoma mansoni N-terminal His6-tagged full-length VKR2 kinase domain expressed in baculovirus infected Sf9 insect cells in p...
In DepthDetails PubMed
TargetGlycogen synthase kinase-3 beta(Homo sapiens (Human))
University Of Jordan
Curated by ChEMBL
LigandPNGBDBM8302(5-phenyl-1H-pyrazolo[3,4-c]pyridin-3-amine | pyraz...)
Affinity DataIC50:  1.26E+3nM. Assay description: Inhibition of recombinant GSK3-beta
In DepthDetails ArticlePubMed