BDBM8310 N-{5-phenyl-1H-pyrazolo[3,4-b]pyridin-3-yl}cyclopentanecarboxamide::pyrazolopyridine deriv. 13
SMILES O=C(Nc1n[nH]c2ncc(cc12)-c1ccccc1)C1CCCC1
InChI Key InChIKey=NJFATVGYCPEPCY-UHFFFAOYSA-N
Data  3 IC50
  Tab Delimited (TSV)   2D SDfile   Computed 3D by Vconf -m prep SDfile
Find this compound or compounds like it in BindingDB:
Activity Spreadsheet -- Enzyme Inhibition Constant Data from BindingDB
Found 3 hits for monomerid = 8310
TargetGlycogen synthase kinase-3 alpha(Homo sapiens (Human))
Glaxosmithkline
LigandPNGBDBM8310(N-{5-phenyl-1H-pyrazolo[3,4-b]pyridin-3-yl}cyclope...)
Affinity DataIC50:  5nMpH: 7.0 T: 2°C. Assay description: The biochemical activity of compounds was determined by incubation with specific enzyme and substrate in the presence 10 uM ATP/ [gamma-33P] ATP. Aft...
In DepthDetails ArticlePubMed
TargetGlycogen synthase kinase-3 alpha(Homo sapiens (Human))
Glaxosmithkline
LigandPNGBDBM8310(N-{5-phenyl-1H-pyrazolo[3,4-b]pyridin-3-yl}cyclope...)
Affinity DataIC50:  5nM. Assay description: Inhibition of human GSK3alpha
In DepthDetails ArticlePubMed
TargetGlycogen synthase kinase-3 beta(Homo sapiens (Human))
University Of Jordan
Curated by ChEMBL
LigandPNGBDBM8310(N-{5-phenyl-1H-pyrazolo[3,4-b]pyridin-3-yl}cyclope...)
Affinity DataIC50:  5nM. Assay description: Inhibition of recombinant GSK3-beta
In DepthDetails ArticlePubMed