BDBM8313 N-[5-(4,4,5,5-tetramethyl-1,3,2-dioxaborolan-2-yl)-1H-pyrazolo[3,4-b]pyridin-3-yl]butanamide::pyrazolopyridine deriv. 16
SMILES CCCC(=O)Nc1n[nH]c2ncc(cc12)B1OC(C)(C)C(C)(C)O1
InChI Key InChIKey=ZXYVYYGVHZWKGW-UHFFFAOYSA-N
Data  2 IC50
  Tab Delimited (TSV)   2D SDfile   Computed 3D by Vconf -m prep SDfile
Find this compound or compounds like it in BindingDB:
Activity Spreadsheet -- Enzyme Inhibition Constant Data from BindingDB
Found 2 hits for monomerid = 8313
TargetGlycogen synthase kinase-3 beta(Homo sapiens (Human))
University Of Jordan
Curated by ChEMBL
LigandPNGBDBM8313(N-[5-(4,4,5,5-tetramethyl-1,3,2-dioxaborolan-2-yl)...)
Affinity DataIC50:  356nM. Assay description: Inhibition of recombinant GSK3-beta
In DepthDetails ArticlePubMed
TargetGlycogen synthase kinase-3 alpha(Homo sapiens (Human))
Glaxosmithkline
LigandPNGBDBM8313(N-[5-(4,4,5,5-tetramethyl-1,3,2-dioxaborolan-2-yl)...)
Affinity DataIC50:  356nMpH: 7.0 T: 2°C. Assay description: The biochemical activity of compounds was determined by incubation with specific enzyme and substrate in the presence 10 uM ATP/ [gamma-33P] ATP. Aft...
In DepthDetails ArticlePubMed