BDBM83192 MLS002694815::N'-(4-chlorobenzoyl)naphthalene-2-carbohydrazide::N'-(4-chlorophenyl)carbonylnaphthalene-2-carbohydrazide::N'-[(4-chlorophenyl)-oxomethyl]-2-naphthalenecarbohydrazide::SMR001560734::cid_258829
SMILES Clc1ccc(cc1)C(=O)NNC(=O)c1ccc2ccccc2c1
InChI Key InChIKey=GFIYISWSUOZJHK-UHFFFAOYSA-N
Data  3 IC50
  Tab Delimited (TSV)   2D SDfile   Computed 3D by Vconf -m prep SDfile
Find this compound or compounds like it in BindingDB:
Activity Spreadsheet -- Enzyme Inhibition Constant Data from BindingDB
Found 3 hits for monomerid = 83192
TargetCarboxy-terminal domain RNA polymerase II polypeptide A small phosphatase 1(Homo sapiens (Human))
Burnham Center For Chemical Genomics
Curated by PubChem BioAssay
LigandPNGBDBM83192(MLS002694815 | N'-(4-chlorobenzoyl)naphthalene-2-c...)
Affinity DataIC50: >8.00E+4nM. Assay description: Data Source: Sanford-Burnham Center for Chemical Genomics (SBCCG) Source Affiliation: Sanford-Burnham Medical Research Institute (SBMRI, San Diego, C...
In DepthDetails PCBioAssay
TargetLow molecular weight phosphotyrosine protein phosphatase(Homo sapiens (Human))
Burnham Center For Chemical Genomics
Curated by PubChem BioAssay
LigandPNGBDBM83192(MLS002694815 | N'-(4-chlorobenzoyl)naphthalene-2-c...)
Affinity DataIC50:  5.41E+4nM
In DepthDetails PCBioAssay
TargetLow molecular weight phosphotyrosine protein phosphatase(Homo sapiens (Human))
Burnham Center For Chemical Genomics
Curated by PubChem BioAssay
LigandPNGBDBM83192(MLS002694815 | N'-(4-chlorobenzoyl)naphthalene-2-c...)
Affinity DataIC50:  2.00E+4nM
In DepthDetails PCBioAssay