BDBM83214 (2Z,6E)-4-methyl-2,6-bis[(1-methyl-2-pyrrolyl)methylidene]-1-cyclohexanone::(2Z,6E)-4-methyl-2,6-bis[(1-methylpyrrol-2-yl)methylene]cyclohexanone::(2Z,6E)-4-methyl-2,6-bis[(1-methylpyrrol-2-yl)methylidene]cyclohexan-1-one::MLS000519844::SMR000130262::cid_6371672
SMILES CC1C\C(=C\c2cccn2C)C(=O)\C(C1)=C\c1cccn1C
InChI Key InChIKey=OSWJIKQLNKDUSD-RHDGPOJRSA-N
Data  2 IC50  2 EC50
  Tab Delimited (TSV)   2D SDfile   Computed 3D by Vconf -m prep SDfile
Find this compound or compounds like it in BindingDB:
Activity Spreadsheet -- Enzyme Inhibition Constant Data from BindingDB
Found 4 hits for monomerid = 83214
TargetEndoribonuclease toxin MazF(Escherichia coli str. K-12 substr. MG1655)
Burnham Center For Chemical Genomics
Curated by PubChem BioAssay
LigandPNGBDBM83214((2Z,6E)-4-methyl-2,6-bis[(1-methyl-2-pyrrolyl)meth...)
Affinity DataEC50: >9.90E+4nM. Assay description: Data Source: Sanford-Burnham Center for Chemical Genomics (SBCCG) Source Affiliation: Sanford-Burnham Medical Research Institute (SBMRI, San Diego, C...
In DepthDetails PCBioAssay
TargetBeta-lactamase(Pseudomonas aeruginosa)
The Scripps Research Institute Molecular Screening Center
Curated by PubChem BioAssay
LigandPNGBDBM83214((2Z,6E)-4-methyl-2,6-bis[(1-methyl-2-pyrrolyl)meth...)
Affinity DataIC50:  4.39E+3nM. Assay description: Source (MLPCN Center Name): The Scripps Research Institute Molecular Screening Center (SRIMSC) Affiliation: The Scripps Research Institute, TSRI Assa...
In DepthDetails PCBioAssay
TargetToll-like receptor 9(Homo sapiens (Human))
The Scripps Research Institute Molecular Screening Center
Curated by PubChem BioAssay
LigandPNGBDBM83214((2Z,6E)-4-methyl-2,6-bis[(1-methyl-2-pyrrolyl)meth...)
Affinity DataIC50:  5.45E+3nM. Assay description: Source (MLPCN Center Name): The Scripps Research Institute Molecular Screening Center (SRIMSC) Affiliation: The Scripps Research Institute, TSRI Assa...
In DepthDetails PCBioAssay
TargetEndoribonuclease toxin MazF(Escherichia coli str. K-12 substr. MG1655)
Burnham Center For Chemical Genomics
Curated by PubChem BioAssay
LigandPNGBDBM83214((2Z,6E)-4-methyl-2,6-bis[(1-methyl-2-pyrrolyl)meth...)
Affinity DataEC50: >9.90E+4nM. Assay description: Data Source: Sanford-Burnham Center for Chemical Genomics (SBCCG) Source Affiliation: Sanford-Burnham Medical Research Institute (SBMRI, San Diego, C...
In DepthDetails PCBioAssay