BDBM8324 N-(5-phenyl-1H-indazol-3-yl)butanamide::indazole analog 4
SMILES CCCC(=O)Nc1n[nH]c2ccc(cc12)-c1ccccc1
InChI Key InChIKey=BEKSOHVYNHFKGU-UHFFFAOYSA-N
Data  2 IC50
  Tab Delimited (TSV)   2D SDfile   Computed 3D by Vconf -m prep SDfile
Find this compound or compounds like it in BindingDB:
Activity Spreadsheet -- Enzyme Inhibition Constant Data from BindingDB
Found 2 hits for monomerid = 8324
TargetGlycogen synthase kinase-3 beta(Homo sapiens (Human))
University Of Jordan
Curated by ChEMBL
LigandPNGBDBM8324(N-(5-phenyl-1H-indazol-3-yl)butanamide | indazole ...)
Affinity DataIC50:  99nM. Assay description: Inhibition of recombinant GSK3-beta
In DepthDetails ArticlePubMed
TargetGlycogen synthase kinase-3 alpha(Homo sapiens (Human))
Glaxosmithkline
LigandPNGBDBM8324(N-(5-phenyl-1H-indazol-3-yl)butanamide | indazole ...)
Affinity DataIC50:  99nM. Assay description: The biochemical activity of compounds was determined by incubation with specific enzyme and substrate in the presence 10 uM ATP/ [gamma-33P] ATP. Aft...
In DepthDetails ArticlePubMed